{"text_format":"1","workbook":"xlsx","n_sheets":10,"sheets":["Config","Hoe gebruiken","0.basisgegevens","1.Overzicht vorderingsstaat","2.Vorderingsstaat","3.VS-A","4.VS-B","LOA","Toelichting Lijst OA","Sjabloon revisies"],"not_rendered":{"charts":0,"images":9,"macros":1,"external_links":0,"defined_names":11,"comments":0,"pivot_tables":0},"unopened":[],"bounds":{"document_bytes":16777216,"sheet_cells":100000,"rows_first":2000,"rows_last":500,"rows_between":2000,"halvings":0,"cell_chars":16384,"cell_head_chars":4096},"cells_cut":0,"cells_raw":0,"read":"whole","date_system":"1900"}

{"sheet":"Config","index":0,"n_rows":51,"n_cols":3,"rows_kept":51,"cut":false,"hidden":true,"merged":[]}
["Graad","Iov","OA"]
[1,{"$f":"IF(LOA!B15=0,\"\",LOA!B15)","v":""},"Ja"]
[2,{"$f":"IF(LOA!B16=0,\"\",LOA!B16)","v":""},"Nee"]
[3,{"$f":"IF(LOA!B17=0,\"\",LOA!B17)","v":""}]
[4,{"$f":"IF(LOA!B18=0,\"\",LOA!B18)","v":""}]
[5,{"$f":"IF(LOA!B19=0,\"\",LOA!B19)","v":""}]
[null,{"$f":"IF(LOA!B20=0,\"\",LOA!B20)","v":""}]
[null,{"$f":"IF(LOA!B21=0,\"\",LOA!B21)","v":""}]
[null,{"$f":"IF(LOA!B22=0,\"\",LOA!B22)","v":""}]
[null,{"$f":"IF(LOA!B23=0,\"\",LOA!B23)","v":""}]
[null,{"$f":"IF(LOA!B24=0,\"\",LOA!B24)","v":""}]
[null,{"$f":"IF(LOA!B25=0,\"\",LOA!B25)","v":""}]
[null,{"$f":"IF(LOA!B26=0,\"\",LOA!B26)","v":""}]
[null,{"$f":"IF(LOA!B27=0,\"\",LOA!B27)","v":""}]
[null,{"$f":"IF(LOA!B28=0,\"\",LOA!B28)","v":""}]
[null,{"$f":"IF(LOA!B29=0,\"\",LOA!B29)","v":""}]
[null,{"$f":"IF(LOA!B30=0,\"\",LOA!B30)","v":""}]
[null,{"$f":"IF(LOA!B31=0,\"\",LOA!B31)","v":""}]
[null,{"$f":"IF(LOA!B32=0,\"\",LOA!B32)","v":""}]
[null,{"$f":"IF(LOA!B33=0,\"\",LOA!B33)","v":""}]
[null,{"$f":"IF(LOA!B34=0,\"\",LOA!B34)","v":""}]
[null,{"$f":"IF(LOA!B35=0,\"\",LOA!B35)","v":""}]
[null,{"$f":"IF(LOA!B36=0,\"\",LOA!B36)","v":""}]
[null,{"$f":"IF(LOA!B37=0,\"\",LOA!B37)","v":""}]
[null,{"$f":"IF(LOA!B38=0,\"\",LOA!B38)","v":""}]
[null,{"$f":"IF(LOA!B39=0,\"\",LOA!B39)","v":""}]
[null,{"$f":"IF(LOA!B40=0,\"\",LOA!B40)","v":""}]
[null,{"$f":"IF(LOA!B41=0,\"\",LOA!B41)","v":""}]
[null,{"$f":"IF(LOA!B42=0,\"\",LOA!B42)","v":""}]
[null,{"$f":"IF(LOA!B43=0,\"\",LOA!B43)","v":""}]
[null,{"$f":"IF(LOA!B44=0,\"\",LOA!B44)","v":""}]
[null,{"$f":"IF(LOA!B45=0,\"\",LOA!B45)","v":""}]
[null,{"$f":"IF(LOA!B46=0,\"\",LOA!B46)","v":""}]
[null,{"$f":"IF(LOA!B47=0,\"\",LOA!B47)","v":""}]
[null,{"$f":"IF(LOA!B48=0,\"\",LOA!B48)","v":""}]
[null,{"$f":"IF(LOA!B49=0,\"\",LOA!B49)","v":""}]
[null,{"$f":"IF(LOA!B50=0,\"\",LOA!B50)","v":""}]
[null,{"$f":"IF(LOA!B51=0,\"\",LOA!B51)","v":""}]
[null,{"$f":"IF(LOA!B52=0,\"\",LOA!B52)","v":""}]
[null,{"$f":"IF(LOA!B53=0,\"\",LOA!B53)","v":""}]
[null,{"$f":"IF(LOA!B54=0,\"\",LOA!B54)","v":""}]
[null,{"$f":"IF(LOA!B55=0,\"\",LOA!B55)","v":""}]
[null,{"$f":"IF(LOA!#REF!=0,\"\",LOA!#REF!)","v":{"$error":"#REF!"}}]
[null,{"$f":"IF(LOA!#REF!=0,\"\",LOA!#REF!)","v":{"$error":"#REF!"}}]
[null,{"$f":"IF(LOA!#REF!=0,\"\",LOA!#REF!)","v":{"$error":"#REF!"}}]
[null,{"$f":"IF(LOA!#REF!=0,\"\",LOA!#REF!)","v":{"$error":"#REF!"}}]
[null,{"$f":"IF(LOA!#REF!=0,\"\",LOA!#REF!)","v":{"$error":"#REF!"}}]
[null,{"$f":"IF(LOA!#REF!=0,\"\",LOA!#REF!)","v":{"$error":"#REF!"}}]
[null,{"$f":"IF(LOA!#REF!=0,\"\",LOA!#REF!)","v":{"$error":"#REF!"}}]
[null,{"$f":"IF(LOA!#REF!=0,\"\",LOA!#REF!)","v":{"$error":"#REF!"}}]
[null,{"$f":"IF(LOA!#REF!=0,\"\",LOA!#REF!)","v":{"$error":"#REF!"}}]

{"sheet":"Hoe gebruiken","index":1,"n_rows":12,"n_cols":4,"rows_kept":12,"cut":false,"hidden":false,"merged":[[1,1,1,2]]}
[]
[null,"Hoe gaat u te werk:",null,"Herzieningen :"]
[null,1,"Vervolledig éénmalig de algemene info in werkblad '0.basisgegevens'\nDe gele cellen kunnen/moeten ingevuld worden indien van toepassing"]
[null,2,"Vervolledig  werkblad '1.Overzicht vorderingsstaat'"]
[null,3,"Werkblad '2.Vorderingsstaat' voorziet een automatische samenvatting, in dit werkblad moet u zelfs niets invullen"]
[null,4,"Werkblad '3.VS1-A' en '4.VS1-B' zijn vrijblijvend te gebruiken. Echter moet wel één geheel van voorbladen en detailstaat aangeboden worden aan UZ Leuven."]
[null,5,"Voeg '1.Overzicht vorderingsstaat' en '2.Vorderingsstaat' toe als voorbladen bij detailstaat"]
[null,6,"Vervolledig details in werkblad LOA voor oplijsting Onder aannemer(s) indien van toepassing"]
[null,7,"OPTIONEEL :\nIndien u automatisch een pdf wil maken van dit document kan u dit doen aan de hand van de knop 'maak pdf' die zich bevindt op werkblad '0.basisgegevens'\n•  er wordt automatisch een afdrukbereik ingesteld op het moment van aanmaak van de pdf. In de werkbladen '3.VS-A' en 4.VS-B' wordt het bereik ingesteld op de laatste rij van kolom 'omschrijving' die nog gegevens bevat."]
[]
[null,null,"Voorkeuren UZ Leuven :"]
[null,null,"• Dien uw VS in als excel bestand, dit vergemakkelijkt het nazicht\n• BTW tarief steeds opgeven (ok indien BTW verlegd) "]

{"sheet":"0.basisgegevens","index":2,"n_rows":26,"n_cols":4,"rows_kept":26,"cut":false,"hidden":false,"merged":[[15,0,15,1],[17,2,17,3]]}
[]
["Projectnummer :"]
["Naam project :"]
["Perceelnummer :"]
["Naam perceel :"]
["Naam projectingenieur UZL :"]
["Naam Project coördinator UZL :"]
["Naam uitvoeringscoördinator :"]
["Naam ontwerper :"]
["Naam aannemer :"]
["Naam derden :"]
["Bestelbon nummer (deel UZL) : "]
["Bestelbon nummer (deel Derden) : "]
["Datum :"]
[]
["In dit sjabloon kan u werken met een deel UZL, een deel gemeenschappelijk en een deel derden, geef de verdeelseutel aan in werkblad '1.Overzicht vorderingsstaat'.\nDruk op de knop om wat u wenst achtereenvolgens zichtbaar te maken of te verbergen:"]
[]
[null,"UZL zichtbaar","Verdeelsleutel"]
[null,null,"Deel UZL","Deel Derden"]
[null,"Gemeenschappelijk verborgen",{"$f":"'1.Overzicht vorderingsstaat'!Z24","v":1},{"$f":"'1.Overzicht vorderingsstaat'!Z25","v":0}]
[]
[null,"Derden verborgen"]
[]
[]
[]
[null,"Indien u wenst om deze vorderingsstaat niet als excel bestand in te dienen kan u aan de hand van deze knop een samengestelde PDF aanmaken van de nodige werkbladen. Mogelijks werk dit niet voor alle gebruikers, in dat geval moet u dit manueel doen met een toepassing om pdf te bewerken. Indien u de knop enkele keren na elkaar wil gebruiken moet u steeds de openstaande PDF afsluiten om te voorkomen dat dit correct zou werken."]

{"sheet":"1.Overzicht vorderingsstaat","index":3,"n_rows":146,"n_cols":74,"rows_kept":146,"cut":false,"hidden":false,"merged":[[144,1,144,2],[144,3,144,8],[144,16,144,21],[144,22,144,27],[144,28,144,33],[144,34,144,39],[144,41,144,42],[144,43,144,48],[144,49,144,54],[144,55,144,60],[144,61,144,66],[144,67,144,72],[145,1,145,2],[145,3,145,8],[145,16,145,21],[145,22,145,27],[145,28,145,33],[145,34,145,39],[145,41,145,42],[145,43,145,48],[145,49,145,54],[145,55,145,60],[145,61,145,66],[145,67,145,72],[142,1,142,2],[142,3,142,8],[142,16,142,21],[142,22,142,27],[142,28,142,33],[142,34,142,39],[142,41,142,42],[142,43,142,48],[142,49,142,54],[142,55,142,60],[142,61,142,66],[142,67,142,72],[143,1,143,2],[143,3,143,8],[143,16,143,21],[143,22,143,27],[143,28,143,33],[143,34,143,39],[143,41,143,42],[143,43,143,48],[143,49,143,54],[143,55,143,60],[143,61,143,66],[143,67,143,72],[140,1,140,2],[140,3,140,8],[140,16,140,21],[140,22,140,27],[140,28,140,33],[140,34,140,39],[140,41,140,42],[140,43,140,48],[140,49,140,54],[140,55,140,60],[140,61,140,66],[140,67,140,72],[141,1,141,2],[141,3,141,8],[141,16,141,21],[141,22,141,27],[141,28,141,33],[141,34,141,39],[141,41,141,42],[141,43,141,48],[141,49,141,54],[141,55,141,60],[141,61,141,66],[141,67,141,72],[138,1,138,2],[138,3,138,8],[138,16,138,21],[138,22,138,27],[138,28,138,33],[138,34,138,39],[138,41,138,42],[138,43,138,48],[138,49,138,54],[138,55,138,60],[138,61,138,66],[138,67,138,72],[139,1,139,2],[139,3,139,8],[139,16,139,21],[139,22,139,27],[139,28,139,33],[139,34,139,39],[139,41,139,42],[139,43,139,48],[139,49,139,54],[139,55,139,60],[139,61,139,66],[139,67,139,72],[136,1,136,2],[136,3,136,8],[136,16,136,21],[136,22,136,27],[136,28,136,33],[136,34,136,39],[136,41,136,42],[136,43,136,48],[136,49,136,54],[136,55,136,60],[136,61,136,66],[136,67,136,72],[137,1,137,2],[137,3,137,8],[137,16,137,21],[137,22,137,27],[137,28,137,33],[137,34,137,39],[137,41,137,42],[137,43,137,48],[137,49,137,54],[137,55,137,60],[137,61,137,66],[137,67,137,72],[108,1,108,2],[108,3,108,8],[108,16,108,21],[108,22,108,27],[108,28,108,33],[108,34,108,39],[108,41,108,42],[108,43,108,48],[108,49,108,54],[108,55,108,60],[108,61,108,66],[108,67,108,72],[109,1,109,2],[109,3,109,8],[109,16,109,21],[109,22,109,27],[109,28,109,33],[109,34,109,39],[109,41,109,42],[109,43,109,48],[109,49,109,54],[109,55,109,60],[109,61,109,66],[109,67,109,72],[106,1,106,2],[106,3,106,8],[106,16,106,21],[106,22,106,27],[106,28,106,33],[106,34,106,39],[106,41,106,42],[106,43,106,48],[106,49,106,54],[106,55,106,60],[106,61,106,66],[106,67,106,72],[107,1,107,2],[107,3,107,8],[107,16,107,21],[107,22,107,27],[107,28,107,33],[107,34,107,39],[107,41,107,42],[107,43,107,48],[107,49,107,54],[107,55,107,60],[107,61,107,66],[107,67,107,72],[104,1,104,2],[104,3,104,8],[104,16,104,21],[104,22,104,27],[104,28,104,33],[104,34,104,39],[104,41,104,42],[104,43,104,48],[104,49,104,54],[104,55,104,60],[104,61,104,66],[104,67,104,72],[105,1,105,2],[105,3,105,8],[105,16,105,21],[105,22,105,27],[105,28,105,33],[105,34,105,39],[105,41,105,42],[105,43,105,48],[105,49,105,54],[105,55,105,60],[105,61,105,66],[105,67,105,72],[102,1,102,2],[102,3,102,8],[102,16,102,21],[102,22,102,27],[102,28,102,33],[102,34,102,39],[102,41,102,42],[102,43,102,48],[102,49,102,54],[102,55,102,60],[102,61,102,66],[102,67,102,72],[103,1,103,2],[103,3,103,8],[103,16,103,21],[103,22,103,27],[103,28,103,33],[103,34,103,39],[103,41,103,42],[103,43,103,48],[103,49,103,54],[103,55,103,60],[103,61,103,66],[103,67,103,72],[100,1,100,2],[100,3,100,8],[100,16,100,21],[100,22,100,27],[100,28,100,33],[100,34,100,39],[100,41,100,42],[100,43,100,48],[100,49,100,54],[100,55,100,60],[100,61,100,66],[100,67,100,72],[101,1,101,2],[101,3,101,8],[101,16,101,21],[101,22,101,27],[101,28,101,33],[101,34,101,39],[101,41,101,42],[101,43,101,48],[101,49,101,54],[101,55,101,60],[101,61,101,66],[101,67,101,72],[72,1,72,2],[72,3,72,8],[72,16,72,21],[72,22,72,27],[72,28,72,33],[72,34,72,39],[72,41,72,42],[72,43,72,48],[72,49,72,54],[72,55,72,60],[72,61,72,66],[72,67,72,72],[73,1,73,2],[73,3,73,8],[73,16,73,21],[73,22,73,27],[73,28,73,33],[73,34,73,39],[73,41,73,42],[73,43,73,48],[73,49,73,54],[73,55,73,60],[73,61,73,66],[73,67,73,72],[70,1,70,2],[70,3,70,8],[70,16,70,21],[70,22,70,27],[70,28,70,33],[70,34,70,39],[70,41,70,42],[70,43,70,48],[70,49,70,54],[70,55,70,60],[70,61,70,66],[70,67,70,72],[71,1,71,2],[71,3,71,8],[71,16,71,21],[71,22,71,27],[71,28,71,33],[71,34,71,39],[71,41,71,42],[71,43,71,48],[71,49,71,54],[71,55,71,60],[71,61,71,66],[71,67,71,72],[68,1,68,2],[68,3,68,8],[68,16,68,21],[68,22,68,27],[68,28,68,33],[68,34,68,39],[68,41,68,42],[68,43,68,48],[68,49,68,54],[68,55,68,60],[68,61,68,66],[68,67,68,72],[69,1,69,2],[69,3,69,8],[69,16,69,21],[69,22,69,27],[69,28,69,33],[69,34,69,39],[69,41,69,42],[69,43,69,48],[69,49,69,54],[69,55,69,60],[69,61,69,66],[69,67,69,72],[66,1,66,2],[66,3,66,8],[66,16,66,21],[66,22,66,27],[66,28,66,33],[66,34,66,39],[66,41,66,42],[66,43,66,48],[66,49,66,54],[66,55,66,60],[66,61,66,66],[66,67,66,72],[67,1,67,2],[67,3,67,8],[67,16,67,21],[67,22,67,27],[67,28,67,33],[67,34,67,39],[67,41,67,42],[67,43,67,48],[67,49,67,54],[67,55,67,60],[67,61,67,66],[67,67,67,72],[64,1,64,2],[64,3,64,8],[64,16,64,21],[64,22,64,27],[64,28,64,33],[64,34,64,39],[64,41,64,42],[64,43,64,48],[64,49,64,54],[64,55,64,60],[64,61,64,66],[64,67,64,72],[65,1,65,2],[65,3,65,8],[65,16,65,21],[65,22,65,27],[65,28,65,33],[65,34,65,39],[65,41,65,42],[65,43,65,48],[65,49,65,54],[65,55,65,60],[65,61,65,66],[65,67,65,72],[76,73,78,73],[28,52,28,54],[43,61,43,66],[43,67,43,72],[43,3,43,8],[43,16,43,21],[43,22,43,27],[43,28,43,33],[43,34,43,39],[43,41,43,42],[43,43,43,48],[43,49,43,54],[43,55,43,60],[36,1,36,7],[36,8,36,21],[36,22,36,28],[36,30,36,36],[36,37,36,43],[31,28,31,36],[60,22,60,27],[31,37,31,45],[42,67,42,72],[62,67,62,72],[63,1,63,2],[63,3,63,8],[63,16,63,21],[63,22,63,27],[63,28,63,33],[61,55,61,60],[62,1,62,2],[62,3,62,8],[62,16,62,21],[62,22,62,27],[62,28,62,33],[62,34,62,39],[62,41,62,42],[63,67,63,72],[63,34,63,39],[63,41,63,42],[63,43,63,48],[63,49,63,54],[60,28,60,33],[62,55,62,60],[62,61,62,66],[0,24,0,66],[61,61,61,66],[61,67,61,72],[58,22,58,27],[58,28,58,33],[58,34,58,39],[58,41,58,42],[58,43,58,48],[58,49,58,54],[62,49,62,54],[56,43,56,48],[56,49,56,54],[52,55,52,60],[52,61,52,66],[52,67,52,72],[50,55,50,60],[50,61,50,66],[50,67,50,72],[46,55,46,60],[46,61,46,66],[59,1,59,2],[59,3,59,8],[59,16,59,21],[59,22,59,27],[59,28,59,33],[59,34,59,39],[59,41,59,42],[76,41,76,72],[76,1,76,39],[58,67,58,72],[59,55,59,60],[59,61,59,66],[59,67,59,72],[63,55,63,60],[63,61,63,66],[62,43,62,48],[60,67,60,72],[61,1,61,2],[61,3,61,8],[61,16,61,21],[61,22,61,27],[61,28,61,33],[61,34,61,39],[61,41,61,42],[61,43,61,48],[61,49,61,54],[60,34,60,39],[60,41,60,42],[60,43,60,48],[60,49,60,54],[60,55,60,60],[60,61,60,66],[60,1,60,2],[60,3,60,8],[60,16,60,21],[58,1,58,2],[58,3,58,8],[58,16,58,21],[59,43,59,48],[59,49,59,54],[56,55,56,60],[56,61,56,66],[58,55,58,60],[58,61,58,66],[56,67,56,72],[57,1,57,2],[57,3,57,8],[57,16,57,21],[57,22,57,27],[57,28,57,33],[57,67,57,72],[57,34,57,39],[57,41,57,42],[57,43,57,48],[57,49,57,54],[57,55,57,60],[57,61,57,66],[56,1,56,2],[56,3,56,8],[56,16,56,21],[56,22,56,27],[56,28,56,33],[56,34,56,39],[56,41,56,42],[54,1,54,2],[54,3,54,8],[54,16,54,21],[54,22,54,27],[54,28,54,33],[54,67,54,72],[55,1,55,2],[55,3,55,8],[55,16,55,21],[55,22,55,27],[55,28,55,33],[55,34,55,39],[55,41,55,42],[55,43,55,48],[55,49,55,54],[54,34,54,39],[54,41,54,42],[54,43,54,48],[54,49,54,54],[54,55,54,60],[54,61,54,66],[55,55,55,60],[55,61,55,66],[55,67,55,72],[53,1,53,2],[53,3,53,8],[53,16,53,21],[53,22,53,27],[53,28,53,33],[53,34,53,39],[53,41,53,42],[53,43,53,48],[53,49,53,54],[53,55,53,60],[53,61,53,66],[53,67,53,72],[52,1,52,2],[52,3,52,8],[52,16,52,21],[52,22,52,27],[52,28,52,33],[52,34,52,39],[52,41,52,42],[52,43,52,48],[52,49,52,54],[51,1,51,2],[51,3,51,8],[51,16,51,21],[51,22,51,27],[51,28,51,33],[51,67,51,72],[51,34,51,39],[51,41,51,42],[51,43,51,48],[51,49,51,54],[51,55,51,60],[51,61,51,66],[50,1,50,2],[50,3,50,8],[50,16,50,21],[50,22,50,27],[50,28,50,33],[50,34,50,39],[50,41,50,42],[50,43,50,48],[50,49,50,54],[48,1,48,2],[48,3,48,8],[48,16,48,21],[48,22,48,27],[48,28,48,33],[48,67,48,72],[49,1,49,2],[49,3,49,8],[49,16,49,21],[49,22,49,27],[49,28,49,33],[49,34,49,39],[49,41,49,42],[49,43,49,48],[49,49,49,54],[48,34,48,39],[48,41,48,42],[48,43,48,48],[48,49,48,54],[48,55,48,60],[48,61,48,66],[49,55,49,60],[49,61,49,66],[49,67,49,72],[46,67,46,72],[47,1,47,2],[47,3,47,8],[47,16,47,21],[47,22,47,27],[47,28,47,33],[47,34,47,39],[47,41,47,42],[47,43,47,48],[47,49,47,54],[47,55,47,60],[47,61,47,66],[47,67,47,72],[46,1,46,2],[46,3,46,8],[46,16,46,21],[46,22,46,27],[46,28,46,33],[46,34,46,39],[46,41,46,42],[46,43,46,48],[46,49,46,54],[44,55,44,60],[44,61,44,66],[44,67,44,72],[45,1,45,2],[45,3,45,8],[45,16,45,21],[45,22,45,27],[45,28,45,33],[45,67,45,72],[45,34,45,39],[45,41,45,42],[45,43,45,48],[45,49,45,54],[45,55,45,60],[45,61,45,66],[44,1,44,2],[44,3,44,8],[44,16,44,21],[44,22,44,27],[44,28,44,33],[44,34,44,39],[44,41,44,42],[44,43,44,48],[44,49,44,54],[19,8,19,21],[42,1,42,2],[23,28,23,36],[43,1,43,2],[42,3,42,8],[42,16,42,21],[42,22,42,27],[42,28,42,33],[42,34,42,39],[42,41,42,42],[42,43,42,48],[42,61,42,66],[35,52,35,54],[42,49,42,54],[41,34,41,39],[41,41,41,42],[41,43,41,48],[41,49,41,54],[40,1,40,39],[37,8,37,21],[37,22,37,28],[36,44,36,50],[36,52,36,54],[26,1,26,28],[26,30,26,50],[27,1,27,7],[27,8,27,21],[27,22,27,28],[27,37,27,43],[27,44,27,50],[27,52,27,54],[24,46,24,54],[23,18,24,24],[23,1,23,17],[24,1,24,17],[24,25,24,27],[23,25,23,27],[17,52,17,54],[18,52,18,54],[22,37,22,45],[22,46,22,54],[13,28,13,36],[13,37,13,45],[13,46,13,54],[18,1,18,7],[18,8,18,21],[18,22,18,28],[18,30,18,36],[18,37,18,43],[18,44,18,50],[17,1,17,7],[17,8,17,21],[17,22,17,28],[17,37,17,43],[17,44,17,50],[23,37,23,45],[23,46,23,54],[24,28,24,36],[24,37,24,45],[19,22,19,28],[19,37,19,43],[19,44,19,50],[21,28,21,36],[21,37,21,45],[8,1,8,16],[9,1,9,16],[8,17,8,32],[9,17,9,32],[4,52,4,54],[4,55,4,57],[16,1,16,28],[16,30,16,50],[6,52,6,59],[6,60,6,68],[5,52,5,59],[5,60,5,68],[9,52,9,55],[9,56,9,59],[9,60,9,64],[9,65,9,68],[15,1,15,27],[15,28,15,36],[15,37,15,45],[15,46,15,54],[14,28,14,36],[4,1,4,16],[5,1,5,16],[10,17,10,32],[11,1,11,16],[11,17,11,32],[5,34,5,42],[10,52,10,55],[10,56,10,59],[10,60,10,64],[10,65,10,68],[7,43,7,50],[21,46,21,54],[22,28,22,36],[2,1,2,16],[2,17,2,32],[2,34,2,42],[2,43,2,50],[3,1,3,16],[3,17,3,32],[3,34,3,42],[3,43,3,50],[2,52,2,68],[3,52,3,68],[4,43,4,50],[7,1,7,16],[7,17,7,32],[12,1,12,16],[4,58,4,60],[4,61,4,63],[4,64,4,65],[4,66,4,68],[4,17,4,32],[5,17,5,32],[6,1,6,16],[10,1,10,16],[5,43,5,50],[14,37,14,45],[14,46,14,54],[14,1,14,7],[21,8,21,27],[6,17,6,32],[4,34,4,42],[7,34,7,42],[28,8,28,21],[29,8,29,21],[28,22,28,28],[29,22,29,28],[28,37,28,43],[28,44,28,50],[29,37,29,43],[29,44,29,50],[34,1,34,28],[34,30,34,50],[35,1,35,7],[35,8,35,21],[35,22,35,28],[35,37,35,43],[35,44,35,50],[32,28,32,36],[32,37,32,45],[32,46,32,54],[33,1,33,27],[31,46,31,54],[32,1,32,7],[77,67,77,72],[78,1,78,2],[78,3,78,8],[78,16,78,21],[78,22,78,27],[78,28,78,33],[78,34,78,39],[78,41,78,42],[78,43,78,48],[78,49,78,54],[78,55,78,60],[78,61,78,66],[78,67,78,72],[77,1,77,2],[77,3,77,8],[77,16,77,21],[77,22,77,27],[77,28,77,33],[77,34,77,39],[77,41,77,42],[77,43,77,48],[77,49,77,54],[77,55,77,60],[77,61,77,66],[41,55,41,60],[41,61,41,66],[42,55,42,60],[21,1,21,7],[13,1,13,7],[31,1,31,7],[13,8,13,27],[31,8,31,27],[22,1,22,7],[79,1,79,2],[79,3,79,8],[79,16,79,21],[79,22,79,27],[79,28,79,33],[79,34,79,39],[79,41,79,42],[79,43,79,48],[79,49,79,54],[33,28,33,36],[33,37,33,45],[33,46,33,54],[75,1,75,73],[40,41,40,72],[37,37,37,43],[37,44,37,50],[39,1,39,73],[40,73,42,73],[41,1,41,2],[41,3,41,8],[41,16,41,21],[41,22,41,27],[41,28,41,33],[41,67,41,72],[79,55,79,60],[79,61,79,66],[79,67,79,72],[80,55,80,60],[80,61,80,66],[80,67,80,72],[81,1,81,2],[81,3,81,8],[81,16,81,21],[81,22,81,27],[81,28,81,33],[81,34,81,39],[81,41,81,42],[81,43,81,48],[81,49,81,54],[81,55,81,60],[81,61,81,66],[81,67,81,72],[80,1,80,2],[80,3,80,8],[80,16,80,21],[80,22,80,27],[80,28,80,33],[80,34,80,39],[80,41,80,42],[80,43,80,48],[80,49,80,54],[41,15,43,15],[77,9,79,9],[77,10,79,10],[77,15,79,15],[82,55,82,60],[82,61,82,66],[82,67,82,72],[83,1,83,2],[83,3,83,8],[83,16,83,21],[83,22,83,27],[83,28,83,33],[83,34,83,39],[83,41,83,42],[83,43,83,48],[83,49,83,54],[83,55,83,60],[83,61,83,66],[83,67,83,72],[82,1,82,2],[82,3,82,8],[82,16,82,21],[82,22,82,27],[82,28,82,33],[82,34,82,39],[82,41,82,42],[82,43,82,48],[82,49,82,54],[84,55,84,60],[84,61,84,66],[84,67,84,72],[85,1,85,2],[85,3,85,8],[85,16,85,21],[85,22,85,27],[85,28,85,33],[85,34,85,39],[85,41,85,42],[85,43,85,48],[85,49,85,54],[85,55,85,60],[85,61,85,66],[85,67,85,72],[84,1,84,2],[84,3,84,8],[84,16,84,21],[84,22,84,27],[84,28,84,33],[84,34,84,39],[84,41,84,42],[84,43,84,48],[84,49,84,54],[86,55,86,60],[86,61,86,66],[86,67,86,72],[87,1,87,2],[87,3,87,8],[87,16,87,21],[87,22,87,27],[87,28,87,33],[87,34,87,39],[87,41,87,42],[87,43,87,48],[87,49,87,54],[87,55,87,60],[87,61,87,66],[87,67,87,72],[86,1,86,2],[86,3,86,8],[86,16,86,21],[86,22,86,27],[86,28,86,33],[86,34,86,39],[86,41,86,42],[86,43,86,48],[86,49,86,54],[88,55,88,60],[88,61,88,66],[88,67,88,72],[89,1,89,2],[89,3,89,8],[89,16,89,21],[89,22,89,27],[89,28,89,33],[89,34,89,39],[89,41,89,42],[89,43,89,48],[89,49,89,54],[89,55,89,60],[89,61,89,66],[89,67,89,72],[88,1,88,2],[88,3,88,8],[88,16,88,21],[88,22,88,27],[88,28,88,33],[88,34,88,39],[88,41,88,42],[88,43,88,48],[88,49,88,54],[90,55,90,60],[90,61,90,66],[90,67,90,72],[91,1,91,2],[91,3,91,8],[91,16,91,21],[91,22,91,27],[91,28,91,33],[91,34,91,39],[91,41,91,42],[91,43,91,48],[91,49,91,54],[91,55,91,60],[91,61,91,66],[91,67,91,72],[90,1,90,2],[90,3,90,8],[90,16,90,21],[90,22,90,27],[90,28,90,33],[90,34,90,39],[90,41,90,42],[90,43,90,48],[90,49,90,54],[92,55,92,60],[92,61,92,66],[92,67,92,72],[93,1,93,2],[93,3,93,8],[93,16,93,21],[93,22,93,27],[93,28,93,33],[93,34,93,39],[93,41,93,42],[93,43,93,48],[93,49,93,54],[93,55,93,60],[93,61,93,66],[93,67,93,72],[92,1,92,2],[92,3,92,8],[92,16,92,21],[92,22,92,27]],"merged_total":1380,"flags":["merged_cut"]}
[null,null,null,null,null,null,null,null,null,null,null,null,null,null,null,null,null,null,null,null,null,null,null,null,{"$f":"CONCATENATE(\"OVERZICHT VORDERINGSSTAAT \",AR3)","v":"OVERZICHT VORDERINGSSTAAT 0"},null,null,null,null,null,null,null,null,null,null,null,null,null,null,null,null,null,null,null,null,null,null,null,null,null,null,null,null,null,null,null,null,null,null,null,null,null,null,null,null,null,null,null,null,null,null,null,null,"SJA_TD_AL_0033_MD21735 V13"]
[]
[null,"Project nummer :",null,null,null,null,null,null,null,null,null,null,null,null,null,null,null,{"$f":"IF('0.basisgegevens'!$B$2=\"\",\"\",'0.basisgegevens'!$B$2)","v":""},null,null,null,null,null,null,null,null,null,null,null,null,null,null,null,null,"Vorderingsstaat nr. :",null,null,null,null,null,null,null,null,0,null,null,null,null,null,null,null,null,"Herzieningscoëfficiënten"]
[null,"Project naam :",null,null,null,null,null,null,null,null,null,null,null,null,null,null,null,{"$f":"IF('0.basisgegevens'!$B$3=\"\",\"\",'0.basisgegevens'!$B$3)","v":""},null,null,null,null,null,null,null,null,null,null,null,null,null,null,null,null,"Omschrijving :",null,null,null,null,null,null,null,null,null,null,null,null,null,null,null,null,null,"p=P * (a*s/S + b*i/I + c)"]
[null,"Perceelnummer :",null,null,null,null,null,null,null,null,null,null,null,null,null,null,null,{"$f":"IF('0.basisgegevens'!$B$4=\"\",\"\",'0.basisgegevens'!$B$4)","v":""},null,null,null,null,null,null,null,null,null,null,null,null,null,null,null,null,"Index :",null,null,null,null,null,null,null,null,null,null,null,null,null,null,null,null,null,"a =",null,null,0.4,null,null,"b =",null,null,0.4,null,null,"c =",null,0.2]
[null,"Naam Perceel :",null,null,null,null,null,null,null,null,null,null,null,null,null,null,null,{"$f":"IF('0.basisgegevens'!$B$5=\"\",\"\",'0.basisgegevens'!$B$5)","v":""},null,null,null,null,null,null,null,null,null,null,null,null,null,null,null,null,"Periode van :",true,null,null,null,null,null,null,null,null,null,null,null,null,null,null,null,null,"S ="]
[null,"Projectingenieur UZL :",null,null,null,null,null,null,null,null,null,null,null,null,null,null,null,{"$f":"IF('0.basisgegevens'!$B$6=\"\",\"\",'0.basisgegevens'!$B$6)","v":""},null,null,null,null,null,null,null,null,null,null,null,null,null,null,null,null,"Periode tot :",null,null,null,null,null,null,null,null,null,null,null,null,null,null,null,null,null,"I ="]
[null,"Projectcoördinator UZL :",null,null,null,null,null,null,null,null,null,null,null,null,null,null,null,{"$f":"IF('0.basisgegevens'!$B$7=\"\",\"\",'0.basisgegevens'!$B$7)","v":""},null,null,null,null,null,null,null,null,null,null,null,null,null,null,null,null,"Datum opmaak :"]
[null,"Uitvoeringscoördinator :",null,null,null,null,null,null,null,null,null,null,null,null,null,null,null,{"$f":"IF('0.basisgegevens'!$B$8=\"\",\"\",'0.basisgegevens'!$B$8)","v":""}]
[null,"Ontwerper :",null,null,null,null,null,null,null,null,null,null,null,null,null,null,null,{"$f":"IF('0.basisgegevens'!$B$9=\"\",\"\",'0.basisgegevens'!$B$9)","v":""},null,null,null,null,null,null,null,null,null,null,null,null,null,null,null,null,null,null,null,null,null,null,null,null,null,null,null,null,null,true]
[null,"Aannemer :",null,null,null,null,null,null,null,null,null,null,null,null,null,null,null,{"$f":"IF('0.basisgegevens'!$B$10=\"\",\"\",'0.basisgegevens'!$B$10)","v":""}]
[null,"Derden :",null,null,null,null,null,null,null,null,null,null,null,null,null,null,null,{"$f":"IF('0.basisgegevens'!$B$11=\"\",\"\",'0.basisgegevens'!$B$11)","v":""},null,null,null,null,null,null,null,null,null,null,null,null,null,null,null,null,"* ook indien BTW verlegd BTW tarief invullen, te betalen totalen in overzicht houden hier apart rekening mee."]
[]
[null,"DEEL UZL",null,null,null,null,null,null,"Bestelbon referentie",null,null,null,null,null,null,null,null,null,null,null,null,null,null,null,null,null,null,null,"Bedrag excl.BTW",null,null,null,null,null,null,null,null,"BTW",null,null,null,null,null,null,null,null,"Totaal"]
[null,"Bestelbon info :",null,null,null,null,null,null,null,null,null,null,null,null,null,null,null,null,null,null,null,null,null,null,null,null,null,null,null,null,null,null,null,null,null,null,null,{"$f":"AC15*BA19","v":0},null,null,null,null,null,null,null,null,{"$f":"AC15+AL15","v":0}]
[]
[null,{"$f":"CONCATENATE(\"Totalen huidige Vorderingsstaat : nr. \",AR3)","v":"Totalen huidige Vorderingsstaat : nr. 0"},null,null,null,null,null,null,null,null,null,null,null,null,null,null,null,null,null,null,null,null,null,null,null,null,null,null,null,null,"Totalen vorige Vorderingsstaten"]
[null,null,null,null,null,null,null,null,"Te herzien bedrag",null,null,null,null,null,null,null,null,null,null,null,null,null,"Herzieningsbedrag",null,null,null,null,null,null,null,null,null,null,null,null,null,null,"Te herzien bedrag",null,null,null,null,null,null,"Herzieningsbedrag",null,null,null,null,null,null,null,"BTW %"]
[null,"Deel A excl. BTW :",null,null,null,null,null,null,{"$f":"SUMIF(B45:C74,$AR$3,D45:I74)","v":0},null,null,null,null,null,null,null,null,null,null,null,null,null,{"$f":"SUMIF(B45:C74,AR3,Q45:V74)","v":0},null,null,null,null,null,null,null,"Deel A excl. BTW :",null,null,null,null,null,null,{"$f":"D43-I19","v":0},null,null,null,null,null,null,{"$f":"Q43-W19","v":0},null,null,null,null,null,null,null,0.21]
[null,"Deel B excl. BTW :",null,null,null,null,null,null,{"$f":"SUMIF(AP45:AQ74,$AR$3,AR45:AW74)","v":0},null,null,null,null,null,null,null,null,null,null,null,null,null,{"$f":"SUMIF(AP45:AQ74,$AR$3,AX45:BC74)","v":0},null,null,null,null,null,null,null,"Deel B excl. BTW :",null,null,null,null,null,null,{"$f":"AR43-I20","v":0},null,null,null,null,null,null,{"$f":"AX43-W20","v":0}]
[]
[null,"DEEL gemeen\nschappelijk",null,null,null,null,null,null,"Bestelbon referentie",null,null,null,null,null,null,null,null,null,null,null,null,null,null,null,null,null,null,null,"Bedrag",null,null,null,null,null,null,null,null,"BTW",null,null,null,null,null,null,null,null,"Totaal"]
[null,"Bestelbon info :",null,null,null,null,null,null,null,null,null,null,null,null,null,null,null,null,null,null,null,null,null,null,null,null,null,null,null,null,null,null,null,null,null,null,null,{"$f":"AC23*BA29","v":0},null,null,null,null,null,null,null,null,{"$f":"AC23+AL23","v":0}]
[null,"aandeel UZL",null,null,null,null,null,null,null,null,null,null,null,null,null,null,null,null,"Verdeelsleutel:",null,null,null,null,null,null,1,null,null,{"$f":"AC23*Z24","v":0},null,null,null,null,null,null,null,null,{"$f":"AC24*BA19","v":0},null,null,null,null,null,null,null,null,{"$f":"AC24+AL24","v":0}]
[null,"aandeel Derden",null,null,null,null,null,null,null,null,null,null,null,null,null,null,null,null,null,null,null,null,null,null,null,{"$f":"1-Z24","v":0},null,null,{"$f":"AC23*Z25","v":0},null,null,null,null,null,null,null,null,{"$f":"AC25*BA37","v":0},null,null,null,null,null,null,null,null,0]
[]
[null,{"$f":"CONCATENATE(\"Totalen huidige Vorderingsstaat : nr. \",AR3)","v":"Totalen huidige Vorderingsstaat : nr. 0"},null,null,null,null,null,null,null,null,null,null,null,null,null,null,null,null,null,null,null,null,null,null,null,null,null,null,null,null,"Totalen vorige Vorderingsstaten"]
[null,null,null,null,null,null,null,null,"Te herzien bedrag",null,null,null,null,null,null,null,null,null,null,null,null,null,"Herzieningsbedrag",null,null,null,null,null,null,null,null,null,null,null,null,null,null,"Te herzien bedrag",null,null,null,null,null,null,"Herzieningsbedrag",null,null,null,null,null,null,null,"BTW %"]
[null,"Deel A excl. BTW :",null,null,null,null,null,null,{"$f":"SUMIF(B81:C110,$AR$3,D81:I110)","v":0},null,null,null,null,null,null,null,null,null,null,null,null,null,{"$f":"SUMIF(B81:C110,AR3,Q81:V110)","v":0},null,null,null,null,null,null,null,"Deel A excl. BTW :",null,null,null,null,null,null,{"$f":"D79-I29","v":0},null,null,null,null,null,null,{"$f":"Q79-W29","v":0}]
[null,"Deel B excl. BTW :",null,null,null,null,null,null,{"$f":"SUMIF(AP81:AQ110,$AR$3,AR81:AW110)","v":0},null,null,null,null,null,null,null,null,null,null,null,null,null,{"$f":"SUMIF(AP81:AQ110,AR3,AX81:BC110)","v":0},null,null,null,null,null,null,null,"Deel B excl. BTW :",null,null,null,null,null,null,{"$f":"AR79-I30","v":0},null,null,null,null,null,null,{"$f":"AX79-W30","v":0}]
[]
[null,"DEEL Derden",null,null,null,null,null,null,"Bestelbon referentie",null,null,null,null,null,null,null,null,null,null,null,null,null,null,null,null,null,null,null,"Bedrag excl.BTW",null,null,null,null,null,null,null,null,"BTW",null,null,null,null,null,null,null,null,"Totaal"]
[null,"Bestelbon info :",null,null,null,null,null,null,null,null,null,null,null,null,null,null,null,null,null,null,null,null,null,null,null,null,null,null,null,null,null,null,null,null,null,null,null,{"$f":"AC33*BA37","v":0},null,null,null,null,null,null,null,null,{"$f":"AC33+AL33","v":0}]
[]
[null,{"$f":"CONCATENATE(\"Totalen huidige Vorderingsstaat : nr. \",AR3)","v":"Totalen huidige Vorderingsstaat : nr. 0"},null,null,null,null,null,null,null,null,null,null,null,null,null,null,null,null,null,null,null,null,null,null,null,null,null,null,null,null,"Totalen vorige Vorderingsstaten"]
[null,null,null,null,null,null,null,null,"Te herzien bedrag",null,null,null,null,null,null,null,null,null,null,null,null,null,"Herzieningsbedrag",null,null,null,null,null,null,null,null,null,null,null,null,null,null,"Te herzien bedrag",null,null,null,null,null,null,"Herzieningsbedrag",null,null,null,null,null,null,null,"BTW %"]
[null,"Deel A excl. BTW :",null,null,null,null,null,null,{"$f":"SUMIF(B117:C146,$AR$3,D117:I146)","v":0},null,null,null,null,null,null,null,null,null,null,null,null,null,{"$f":"SUMIF(B117:C146,AR3,Q117:V146)","v":0},null,null,null,null,null,null,null,"Deel A excl. BTW :",null,null,null,null,null,null,{"$f":"D115-I37","v":0},null,null,null,null,null,null,{"$f":"Q115-W37","v":0}]
[null,"Deel B excl. BTW :",null,null,null,null,null,null,{"$f":"SUMIF(AP117:AQ146,$AR$3,AR117:AW146)","v":0},null,null,null,null,null,null,null,null,null,null,null,null,null,{"$f":"SUMIF(AP117:AQ146,AR3,AX117:BC146)","v":0},null,null,null,null,null,null,null,"Deel B excl. BTW :",null,null,null,null,null,null,{"$f":"AR115-I38","v":0},null,null,null,null,null,null,{"$f":"AX115-W38","v":0}]
[]
[null,"OVERZICHT VORDERINGSSTATEN DEEL UZL"]
[null,"Overzicht vorderingsstaten deel A",null,null,null,null,null,null,null,null,null,null,null,null,null,null,null,null,null,null,null,null,null,null,null,null,null,null,null,null,null,null,null,null,null,null,null,null,null,null,null,"Overzicht vorderingsstaten deel B",null,null,null,null,null,null,null,null,null,null,null,null,null,null,null,null,null,null,null,null,null,null,null,null,null,null,null,null,null,null,null,"Vorderings % (excl.BTW)"]
[null,"Nr.",null,"Te herzien bedrag",null,null,null,null,null,"s","i","s/S","a*(s/S)","i/I","b*(i/I)","p","Herzieningsbedrag",null,null,null,null,null,"Bedrag excl. BTW",null,null,null,null,null,"BTW",null,null,null,null,null,"Bedrag incl BTW",null,null,null,null,null,null,"Nr.",null,"Te herzien bedrag",null,null,null,null,null,"Herzieningsbedrag",null,null,null,null,null,"Bedrag excl. BTW",null,null,null,null,null,"BTW",null,null,null,null,null,"Bedrag incl BTW"]
[null,"Tot.",null,{"$f":"SUM(D45:I74)","v":0},{"$f":"IFERROR(IF(SUM(E49:E1058)<>0,SUM(E49:E1058),\"\"),\"\")","v":""},{"$f":"IFERROR(IF(SUM(F49:F1058)<>0,SUM(F49:F1058),\"\"),\"\")","v":""},{"$f":"IFERROR(IF(SUM(G49:G1058)<>0,SUM(G49:G1058),\"\"),\"\")","v":""},{"$f":"IFERROR(IF(SUM(H49:H1058)<>0,SUM(H49:H1058),\"\"),\"\")","v":""},{"$f":"IFERROR(IF(SUM(I49:I1058)<>0,SUM(I49:I1058),\"\"),\"\")","v":""},null,null,null,null,null,null,null,{"$f":"SUM(Q45:V74)","v":0},{"$f":"IFERROR(IF(SUM(R49:R1058)<>0,SUM(R49:R1058),\"\"),\"\")","v":""},{"$f":"IFERROR(IF(SUM(S49:S1058)<>0,SUM(S49:S1058),\"\"),\"\")","v":""},{"$f":"IFERROR(IF(SUM(T49:T1058)<>0,SUM(T49:T1058),\"\"),\"\")","v":""},{"$f":"IFERROR(IF(SUM(U49:U1058)<>0,SUM(U49:U1058),\"\"),\"\")","v":""},{"$f":"IFERROR(IF(SUM(V49:V1058)<>0,SUM(V49:V1058),\"\"),\"\")","v":""},{"$f":"SUM(W45:AB74)","v":0},{"$f":"IFERROR(IF(SUM(X49:X1058)<>0,SUM(X49:X1058),\"\"),\"\")","v":""},{"$f":"IFERROR(IF(SUM(Y49:Y1058)<>0,SUM(Y49:Y1058),\"\"),\"\")","v":""},{"$f":"IFERROR(IF(SUM(Z49:Z1058)<>0,SUM(Z49:Z1058),\"\"),\"\")","v":""},{"$f":"IFERROR(IF(SUM(AA49:AA1058)<>0,SUM(AA49:AA1058),\"\"),\"\")","v":""},{"$f":"IFERROR(IF(SUM(AB49:AB1058)<>0,SUM(AB49:AB1058),\"\"),\"\")","v":""},{"$f":"SUM(AC45:AH74)","v":0},{"$f":"IFERROR(IF(SUM(AD49:AD1058)<>0,SUM(AD49:AD1058),\"\"),\"\")","v":""},{"$f":"IFERROR(IF(SUM(AE49:AE1058)<>0,SUM(AE49:AE1058),\"\"),\"\")","v":""},{"$f":"IFERROR(IF(SUM(AF49:AF1058)<>0,SUM(AF49:AF1058),\"\"),\"\")","v":""},{"$f":"IFERROR(IF(SUM(AG49:AG1058)<>0,SUM(AG49:AG1058),\"\"),\"\")","v":""},{"$f":"IFERROR(IF(SUM(AH49:AH1058)<>0,SUM(AH49:AH1058),\"\"),\"\")","v":""},{"$f":"SUM(AI45:AN74)","v":0},{"$f":"IFERROR(IF(SUM(AJ49:AJ1058)<>0,SUM(AJ49:AJ1058),\"\"),\"\")","v":""},{"$f":"IFERROR(IF(SUM(AK49:AK1058)<>0,SUM(AK49:AK1058),\"\"),\"\")","v":""},{"$f":"IFERROR(IF(SUM(AL49:AL1058)<>0,SUM(AL49:AL1058),\"\"),\"\")","v":""},{"$f":"IFERROR(IF(SUM(AM49:AM1058)<>0,SUM(AM49:AM1058),\"\"),\"\")","v":""},{"$f":"IFERROR(IF(SUM(AN49:AN1058)<>0,SUM(AN49:AN1058),\"\"),\"\")","v":""},null,"Tot.",null,{"$f":"SUM(AR45:AW74)","v":0},{"$f":"IFERROR(IF(SUM(AS49:AS1058)<>0,SUM(AS49:AS1058),\"\"),\"\")","v":""},{"$f":"IFERROR(IF(SUM(AT49:AT1058)<>0,SUM(AT49:AT1058),\"\"),\"\")","v":""},{"$f":"IFERROR(IF(SUM(AU49:AU1058)<>0,SUM(AU49:AU1058),\"\"),\"\")","v":""},{"$f":"IFERROR(IF(SUM(AV49:AV1058)<>0,SUM(AV49:AV1058),\"\"),\"\")","v":""},{"$f":"IFERROR(IF(SUM(AW49:AW1058)<>0,SUM(AW49:AW1058),\"\"),\"\")","v":""},{"$f":"SUM(AX45:BC74)","v":0},{"$f":"IFERROR(IF(SUM(AY49:AY1058)<>0,SUM(AY49:AY1058),\"\"),\"\")","v":""},{"$f":"IFERROR(IF(SUM(AZ49:AZ1058)<>0,SUM(AZ49:AZ1058),\"\"),\"\")","v":""},{"$f":"IFERROR(IF(SUM(BA49:BA1058)<>0,SUM(BA49:BA1058),\"\"),\"\")","v":""},{"$f":"IFERROR(IF(SUM(BB49:BB1058)<>0,SUM(BB49:BB1058),\"\"),\"\")","v":""},{"$f":"IFERROR(IF(SUM(BC49:BC1058)<>0,SUM(BC49:BC1058),\"\"),\"\")","v":""},{"$f":"SUM(BD45:BI74)","v":0},{"$f":"IFERROR(IF(SUM(BE49:BE1058)<>0,SUM(BE49:BE1058),\"\"),\"\")","v":""},{"$f":"IFERROR(IF(SUM(BF49:BF1058)<>0,SUM(BF49:BF1058),\"\"),\"\")","v":""},{"$f":"IFERROR(IF(SUM(BG49:BG1058)<>0,SUM(BG49:BG1058),\"\"),\"\")","v":""},{"$f":"IFERROR(IF(SUM(BH49:BH1058)<>0,SUM(BH49:BH1058),\"\"),\"\")","v":""},{"$f":"IFERROR(IF(SUM(BI49:BI1058)<>0,SUM(BI49:BI1058),\"\"),\"\")","v":""},{"$f":"SUM(BJ45:BO74)","v":0},{"$f":"IFERROR(IF(SUM(BK49:BK1058)<>0,SUM(BK49:BK1058),\"\"),\"\")","v":""},{"$f":"IFERROR(IF(SUM(BL49:BL1058)<>0,SUM(BL49:BL1058),\"\"),\"\")","v":""},{"$f":"IFERROR(IF(SUM(BM49:BM1058)<>0,SUM(BM49:BM1058),\"\"),\"\")","v":""},{"$f":"IFERROR(IF(SUM(BN49:BN1058)<>0,SUM(BN49:BN1058),\"\"),\"\")","v":""},{"$f":"IFERROR(IF(SUM(BO49:BO1058)<>0,SUM(BO49:BO1058),\"\"),\"\")","v":""},{"$f":"SUM(BP45:BU74)","v":0},{"$f":"IFERROR(IF(SUM(BQ49:BQ1058)<>0,SUM(BQ49:BQ1058),\"\"),\"\")","v":""},{"$f":"IFERROR(IF(SUM(BR49:BR1058)<>0,SUM(BR49:BR1058),\"\"),\"\")","v":""},{"$f":"IFERROR(IF(SUM(BS49:BS1058)<>0,SUM(BS49:BS1058),\"\"),\"\")","v":""},{"$f":"IFERROR(IF(SUM(BT49:BT1058)<>0,SUM(BT49:BT1058),\"\"),\"\")","v":""},{"$f":"IFERROR(IF(SUM(BU49:BU1058)<>0,SUM(BU49:BU1058),\"\"),\"\")","v":""}]
[null,0,null,0,null,null,null,null,null,null,null,null,null,null,null,null,0,null,null,null,null,null,0,null,null,null,null,null,0,null,null,null,null,null,0,null,null,null,null,null,null,0,null,0,null,null,null,null,null,0,null,null,null,null,null,0,null,null,null,null,null,0,null,null,null,null,null,0]
[null,1,null,null,null,null,null,null,null,null,null,{"$f":"(ROUND(J45/$BI$6,5))","v":{"$error":"#DIV/0!"}},{"$f":"(ROUND($BD$5*L45,5))","v":{"$error":"#DIV/0!"}},{"$f":"ROUND(K45/$BI$7,5)","v":{"$error":"#DIV/0!"}},{"$f":"ROUND($BJ$5*N45,5)","v":{"$error":"#DIV/0!"}},{"$f":"IF(AND(J45<>\"\",K45<>\"\"),ROUND(M45+O45+$BO$5,5),0)","v":0},{"$f":"IF(P45=0,0,(D45*P45)-D45)","v":0},null,null,null,null,null,{"$f":"D45+Q45","v":0},null,null,null,null,null,{"$f":"IF('2.Vorderingsstaat'!$AC$6=TRUE,\"BTW verlegd\",W45*$BA$19)","v":"BTW verlegd"},null,null,null,null,null,{"$f":"IF('2.Vorderingsstaat'!$AC$6=TRUE,\"BTW verlegd\",AC45+W45)","v":"BTW verlegd"},null,null,null,null,null,null,1,null,null,null,null,null,null,null,null,null,null,null,null,null,{"$f":"AR45+AX45","v":0},null,null,null,null,null,{"$f":"IF('2.Vorderingsstaat'!$AC$6=TRUE,\"BTW verlegd\",BD45*$BA$19)","v":"BTW verlegd"},null,null,null,null,null,{"$f":"IF('2.Vorderingsstaat'!$AC$6=TRUE,\"BTW verlegd\",BJ45+BD45)","v":"BTW verlegd"},null,null,null,null,null,{"$f":"IF(D45=\"\",0,IFERROR((D45+AR45)/$AC$15,0))","v":0}]
[null,2,null,null,null,null,null,null,null,null,null,{"$f":"(ROUND(J46/$BI$6,5))","v":{"$error":"#DIV/0!"}},{"$f":"(ROUND($BD$5*L46,5))","v":{"$error":"#DIV/0!"}},{"$f":"ROUND(K46/$BI$7,5)","v":{"$error":"#DIV/0!"}},{"$f":"ROUND($BJ$5*N46,5)","v":{"$error":"#DIV/0!"}},{"$f":"IF(AND(J46<>\"\",K46<>\"\"),ROUND(M46+O46+$BO$5,5),0)","v":0},{"$f":"IF(P46=0,0,(D46*P46)-D46)","v":0},null,null,null,null,null,{"$f":"D46+Q46","v":0},null,null,null,null,null,{"$f":"IF('2.Vorderingsstaat'!$AC$6=TRUE,\"BTW verlegd\",W46*$BA$19)","v":"BTW verlegd"},null,null,null,null,null,{"$f":"IF('2.Vorderingsstaat'!$AC$6=TRUE,\"BTW verlegd\",AC46+W46)","v":"BTW verlegd"},null,null,null,null,null,null,2,null,null,null,null,null,null,null,null,null,null,null,null,null,{"$f":"AR46+AX46","v":0},null,null,null,null,null,{"$f":"IF('2.Vorderingsstaat'!$AC$6=TRUE,\"BTW verlegd\",BD46*$BA$19)","v":"BTW verlegd"},null,null,null,null,null,{"$f":"IF('2.Vorderingsstaat'!$AC$6=TRUE,\"BTW verlegd\",BJ46+BD46)","v":"BTW verlegd"},null,null,null,null,null,{"$f":"IF(D46=\"\",0,IFERROR((SUM($AR$45:AW46,$D$45:I46)/$AC$15),0))","v":0}]
[null,3,null,null,null,null,null,null,null,null,null,{"$error":"#DIV/0!"},{"$error":"#DIV/0!"},{"$error":"#DIV/0!"},{"$error":"#DIV/0!"},0,0,null,null,null,null,null,0,null,null,null,null,null,{"$f":"IF('2.Vorderingsstaat'!$AC$6=TRUE,\"BTW verlegd\",W47*$BA$19)","v":"BTW verlegd"},null,null,null,null,null,{"$f":"IF('2.Vorderingsstaat'!$AC$6=TRUE,\"BTW verlegd\",AC47+W47)","v":"BTW verlegd"},null,null,null,null,null,null,3,null,null,null,null,null,null,null,null,null,null,null,null,null,0,null,null,null,null,null,{"$f":"IF('2.Vorderingsstaat'!$AC$6=TRUE,\"BTW verlegd\",BD47*$BA$19)","v":"BTW verlegd"},null,null,null,null,null,{"$f":"IF('2.Vorderingsstaat'!$AC$6=TRUE,\"BTW verlegd\",BJ47+BD47)","v":"BTW verlegd"},null,null,null,null,null,{"$f":"IF(D47=\"\",0,IFERROR((SUM($AR$45:AW47,$D$45:I47)/$AC$15),0))","v":0}]
[null,4,null,null,null,null,null,null,null,null,null,{"$error":"#DIV/0!"},{"$error":"#DIV/0!"},{"$error":"#DIV/0!"},{"$error":"#DIV/0!"},0,0,null,null,null,null,null,0,null,null,null,null,null,{"$f":"IF('2.Vorderingsstaat'!$AC$6=TRUE,\"BTW verlegd\",W48*$BA$19)","v":"BTW verlegd"},null,null,null,null,null,{"$f":"IF('2.Vorderingsstaat'!$AC$6=TRUE,\"BTW verlegd\",AC48+W48)","v":"BTW verlegd"},null,null,null,null,null,null,4,null,null,null,null,null,null,null,null,null,null,null,null,null,0,null,null,null,null,null,{"$f":"IF('2.Vorderingsstaat'!$AC$6=TRUE,\"BTW verlegd\",BD48*$BA$19)","v":"BTW verlegd"},null,null,null,null,null,{"$f":"IF('2.Vorderingsstaat'!$AC$6=TRUE,\"BTW verlegd\",BJ48+BD48)","v":"BTW verlegd"},null,null,null,null,null,{"$f":"IF(D48=\"\",0,IFERROR((SUM($AR$45:AW48,$D$45:I48)/$AC$15),0))","v":0}]
[null,5,null,null,null,null,null,null,null,null,null,{"$error":"#DIV/0!"},{"$error":"#DIV/0!"},{"$error":"#DIV/0!"},{"$error":"#DIV/0!"},0,0,null,null,null,null,null,0,null,null,null,null,null,{"$f":"IF('2.Vorderingsstaat'!$AC$6=TRUE,\"BTW verlegd\",W49*$BA$19)","v":"BTW verlegd"},null,null,null,null,null,{"$f":"IF('2.Vorderingsstaat'!$AC$6=TRUE,\"BTW verlegd\",AC49+W49)","v":"BTW verlegd"},null,null,null,null,null,null,5,null,null,null,null,null,null,null,null,null,null,null,null,null,0,null,null,null,null,null,{"$f":"IF('2.Vorderingsstaat'!$AC$6=TRUE,\"BTW verlegd\",BD49*$BA$19)","v":"BTW verlegd"},null,null,null,null,null,{"$f":"IF('2.Vorderingsstaat'!$AC$6=TRUE,\"BTW verlegd\",BJ49+BD49)","v":"BTW verlegd"},null,null,null,null,null,{"$f":"IF(D49=\"\",0,IFERROR((SUM($AR$45:AW49,$D$45:I49)/$AC$15),0))","v":0}]
[null,6,null,null,null,null,null,null,null,null,null,{"$error":"#DIV/0!"},{"$error":"#DIV/0!"},{"$error":"#DIV/0!"},{"$error":"#DIV/0!"},0,0,null,null,null,null,null,0,null,null,null,null,null,{"$f":"IF('2.Vorderingsstaat'!$AC$6=TRUE,\"BTW verlegd\",W50*$BA$19)","v":"BTW verlegd"},null,null,null,null,null,{"$f":"IF('2.Vorderingsstaat'!$AC$6=TRUE,\"BTW verlegd\",AC50+W50)","v":"BTW verlegd"},null,null,null,null,null,null,6,null,null,null,null,null,null,null,null,null,null,null,null,null,0,null,null,null,null,null,{"$f":"IF('2.Vorderingsstaat'!$AC$6=TRUE,\"BTW verlegd\",BD50*$BA$19)","v":"BTW verlegd"},null,null,null,null,null,{"$f":"IF('2.Vorderingsstaat'!$AC$6=TRUE,\"BTW verlegd\",BJ50+BD50)","v":"BTW verlegd"},null,null,null,null,null,{"$f":"IF(D50=\"\",0,IFERROR((SUM($AR$45:AW50,$D$45:I50)/$AC$15),0))","v":0}]
[null,7,null,null,null,null,null,null,null,null,null,{"$error":"#DIV/0!"},{"$error":"#DIV/0!"},{"$error":"#DIV/0!"},{"$error":"#DIV/0!"},0,0,null,null,null,null,null,0,null,null,null,null,null,{"$f":"IF('2.Vorderingsstaat'!$AC$6=TRUE,\"BTW verlegd\",W51*$BA$19)","v":"BTW verlegd"},null,null,null,null,null,{"$f":"IF('2.Vorderingsstaat'!$AC$6=TRUE,\"BTW verlegd\",AC51+W51)","v":"BTW verlegd"},null,null,null,null,null,null,7,null,null,null,null,null,null,null,null,null,null,null,null,null,0,null,null,null,null,null,{"$f":"IF('2.Vorderingsstaat'!$AC$6=TRUE,\"BTW verlegd\",BD51*$BA$19)","v":"BTW verlegd"},null,null,null,null,null,{"$f":"IF('2.Vorderingsstaat'!$AC$6=TRUE,\"BTW verlegd\",BJ51+BD51)","v":"BTW verlegd"},null,null,null,null,null,{"$f":"IF(D51=\"\",0,IFERROR((SUM($AR$45:AW51,$D$45:I51)/$AC$15),0))","v":0}]
[null,8,null,null,null,null,null,null,null,null,null,{"$error":"#DIV/0!"},{"$error":"#DIV/0!"},{"$error":"#DIV/0!"},{"$error":"#DIV/0!"},0,0,null,null,null,null,null,0,null,null,null,null,null,{"$f":"IF('2.Vorderingsstaat'!$AC$6=TRUE,\"BTW verlegd\",W52*$BA$19)","v":"BTW verlegd"},null,null,null,null,null,{"$f":"IF('2.Vorderingsstaat'!$AC$6=TRUE,\"BTW verlegd\",AC52+W52)","v":"BTW verlegd"},null,null,null,null,null,null,8,null,null,null,null,null,null,null,null,null,null,null,null,null,0,null,null,null,null,null,{"$f":"IF('2.Vorderingsstaat'!$AC$6=TRUE,\"BTW verlegd\",BD52*$BA$19)","v":"BTW verlegd"},null,null,null,null,null,{"$f":"IF('2.Vorderingsstaat'!$AC$6=TRUE,\"BTW verlegd\",BJ52+BD52)","v":"BTW verlegd"},null,null,null,null,null,{"$f":"IF(D52=\"\",0,IFERROR((SUM($AR$45:AW52,$D$45:I52)/$AC$15),0))","v":0}]
[null,9,null,null,null,null,null,null,null,null,null,{"$error":"#DIV/0!"},{"$error":"#DIV/0!"},{"$error":"#DIV/0!"},{"$error":"#DIV/0!"},0,0,null,null,null,null,null,0,null,null,null,null,null,{"$f":"IF('2.Vorderingsstaat'!$AC$6=TRUE,\"BTW verlegd\",W53*$BA$19)","v":"BTW verlegd"},null,null,null,null,null,{"$f":"IF('2.Vorderingsstaat'!$AC$6=TRUE,\"BTW verlegd\",AC53+W53)","v":"BTW verlegd"},null,null,null,null,null,null,9,null,null,null,null,null,null,null,null,null,null,null,null,null,0,null,null,null,null,null,{"$f":"IF('2.Vorderingsstaat'!$AC$6=TRUE,\"BTW verlegd\",BD53*$BA$19)","v":"BTW verlegd"},null,null,null,null,null,{"$f":"IF('2.Vorderingsstaat'!$AC$6=TRUE,\"BTW verlegd\",BJ53+BD53)","v":"BTW verlegd"},null,null,null,null,null,{"$f":"IF(D53=\"\",0,IFERROR((SUM($AR$45:AW53,$D$45:I53)/$AC$15),0))","v":0}]
[null,10,null,null,null,null,null,null,null,null,null,{"$error":"#DIV/0!"},{"$error":"#DIV/0!"},{"$error":"#DIV/0!"},{"$error":"#DIV/0!"},0,0,null,null,null,null,null,0,null,null,null,null,null,{"$f":"IF('2.Vorderingsstaat'!$AC$6=TRUE,\"BTW verlegd\",W54*$BA$19)","v":"BTW verlegd"},null,null,null,null,null,{"$f":"IF('2.Vorderingsstaat'!$AC$6=TRUE,\"BTW verlegd\",AC54+W54)","v":"BTW verlegd"},null,null,null,null,null,null,10,null,null,null,null,null,null,null,null,null,null,null,null,null,0,null,null,null,null,null,{"$f":"IF('2.Vorderingsstaat'!$AC$6=TRUE,\"BTW verlegd\",BD54*$BA$19)","v":"BTW verlegd"},null,null,null,null,null,{"$f":"IF('2.Vorderingsstaat'!$AC$6=TRUE,\"BTW verlegd\",BJ54+BD54)","v":"BTW verlegd"},null,null,null,null,null,{"$f":"IF(D54=\"\",0,IFERROR((SUM($AR$45:AW54,$D$45:I54)/$AC$15),0))","v":0}]
[null,11,null,null,null,null,null,null,null,null,null,{"$error":"#DIV/0!"},{"$error":"#DIV/0!"},{"$error":"#DIV/0!"},{"$error":"#DIV/0!"},0,0,null,null,null,null,null,0,null,null,null,null,null,{"$f":"IF('2.Vorderingsstaat'!$AC$6=TRUE,\"BTW verlegd\",W55*$BA$19)","v":"BTW verlegd"},null,null,null,null,null,{"$f":"IF('2.Vorderingsstaat'!$AC$6=TRUE,\"BTW verlegd\",AC55+W55)","v":"BTW verlegd"},null,null,null,null,null,null,11,null,null,null,null,null,null,null,null,null,null,null,null,null,0,null,null,null,null,null,{"$f":"IF('2.Vorderingsstaat'!$AC$6=TRUE,\"BTW verlegd\",BD55*$BA$19)","v":"BTW verlegd"},null,null,null,null,null,{"$f":"IF('2.Vorderingsstaat'!$AC$6=TRUE,\"BTW verlegd\",BJ55+BD55)","v":"BTW verlegd"},null,null,null,null,null,{"$f":"IF(D55=\"\",0,IFERROR((SUM($AR$45:AW55,$D$45:I55)/$AC$15),0))","v":0}]
[null,12,null,null,null,null,null,null,null,null,null,{"$error":"#DIV/0!"},{"$error":"#DIV/0!"},{"$error":"#DIV/0!"},{"$error":"#DIV/0!"},0,0,null,null,null,null,null,0,null,null,null,null,null,{"$f":"IF('2.Vorderingsstaat'!$AC$6=TRUE,\"BTW verlegd\",W56*$BA$19)","v":"BTW verlegd"},null,null,null,null,null,{"$f":"IF('2.Vorderingsstaat'!$AC$6=TRUE,\"BTW verlegd\",AC56+W56)","v":"BTW verlegd"},null,null,null,null,null,null,12,null,null,null,null,null,null,null,null,null,null,null,null,null,0,null,null,null,null,null,{"$f":"IF('2.Vorderingsstaat'!$AC$6=TRUE,\"BTW verlegd\",BD56*$BA$19)","v":"BTW verlegd"},null,null,null,null,null,{"$f":"IF('2.Vorderingsstaat'!$AC$6=TRUE,\"BTW verlegd\",BJ56+BD56)","v":"BTW verlegd"},null,null,null,null,null,{"$f":"IF(D56=\"\",0,IFERROR((SUM($AR$45:AW56,$D$45:I56)/$AC$15),0))","v":0}]
[null,13,null,null,null,null,null,null,null,null,null,{"$error":"#DIV/0!"},{"$error":"#DIV/0!"},{"$error":"#DIV/0!"},{"$error":"#DIV/0!"},0,0,null,null,null,null,null,0,null,null,null,null,null,{"$f":"IF('2.Vorderingsstaat'!$AC$6=TRUE,\"BTW verlegd\",W57*$BA$19)","v":"BTW verlegd"},null,null,null,null,null,{"$f":"IF('2.Vorderingsstaat'!$AC$6=TRUE,\"BTW verlegd\",AC57+W57)","v":"BTW verlegd"},null,null,null,null,null,null,13,null,null,null,null,null,null,null,null,null,null,null,null,null,0,null,null,null,null,null,{"$f":"IF('2.Vorderingsstaat'!$AC$6=TRUE,\"BTW verlegd\",BD57*$BA$19)","v":"BTW verlegd"},null,null,null,null,null,{"$f":"IF('2.Vorderingsstaat'!$AC$6=TRUE,\"BTW verlegd\",BJ57+BD57)","v":"BTW verlegd"},null,null,null,null,null,{"$f":"IF(D57=\"\",0,IFERROR((SUM($AR$45:AW57,$D$45:I57)/$AC$15),0))","v":0}]
[null,14,null,null,null,null,null,null,null,null,null,{"$error":"#DIV/0!"},{"$error":"#DIV/0!"},{"$error":"#DIV/0!"},{"$error":"#DIV/0!"},0,0,null,null,null,null,null,0,null,null,null,null,null,{"$f":"IF('2.Vorderingsstaat'!$AC$6=TRUE,\"BTW verlegd\",W58*$BA$19)","v":"BTW verlegd"},null,null,null,null,null,{"$f":"IF('2.Vorderingsstaat'!$AC$6=TRUE,\"BTW verlegd\",AC58+W58)","v":"BTW verlegd"},null,null,null,null,null,null,14,null,null,null,null,null,null,null,null,null,null,null,null,null,0,null,null,null,null,null,{"$f":"IF('2.Vorderingsstaat'!$AC$6=TRUE,\"BTW verlegd\",BD58*$BA$19)","v":"BTW verlegd"},null,null,null,null,null,{"$f":"IF('2.Vorderingsstaat'!$AC$6=TRUE,\"BTW verlegd\",BJ58+BD58)","v":"BTW verlegd"},null,null,null,null,null,{"$f":"IF(D58=\"\",0,IFERROR((SUM($AR$45:AW58,$D$45:I58)/$AC$15),0))","v":0}]
[null,15,null,null,null,null,null,null,null,null,null,{"$error":"#DIV/0!"},{"$error":"#DIV/0!"},{"$error":"#DIV/0!"},{"$error":"#DIV/0!"},0,0,null,null,null,null,null,0,null,null,null,null,null,{"$f":"IF('2.Vorderingsstaat'!$AC$6=TRUE,\"BTW verlegd\",W59*$BA$19)","v":"BTW verlegd"},null,null,null,null,null,{"$f":"IF('2.Vorderingsstaat'!$AC$6=TRUE,\"BTW verlegd\",AC59+W59)","v":"BTW verlegd"},null,null,null,null,null,null,15,null,null,null,null,null,null,null,null,null,null,null,null,null,0,null,null,null,null,null,{"$f":"IF('2.Vorderingsstaat'!$AC$6=TRUE,\"BTW verlegd\",BD59*$BA$19)","v":"BTW verlegd"},null,null,null,null,null,{"$f":"IF('2.Vorderingsstaat'!$AC$6=TRUE,\"BTW verlegd\",BJ59+BD59)","v":"BTW verlegd"},null,null,null,null,null,{"$f":"IF(D59=\"\",0,IFERROR((SUM($AR$45:AW59,$D$45:I59)/$AC$15),0))","v":0}]
[null,16,null,null,null,null,null,null,null,null,null,{"$error":"#DIV/0!"},{"$error":"#DIV/0!"},{"$error":"#DIV/0!"},{"$error":"#DIV/0!"},0,0,null,null,null,null,null,0,null,null,null,null,null,{"$f":"IF('2.Vorderingsstaat'!$AC$6=TRUE,\"BTW verlegd\",W60*$BA$19)","v":"BTW verlegd"},null,null,null,null,null,{"$f":"IF('2.Vorderingsstaat'!$AC$6=TRUE,\"BTW verlegd\",AC60+W60)","v":"BTW verlegd"},null,null,null,null,null,null,16,null,null,null,null,null,null,null,null,null,null,null,null,null,0,null,null,null,null,null,{"$f":"IF('2.Vorderingsstaat'!$AC$6=TRUE,\"BTW verlegd\",BD60*$BA$19)","v":"BTW verlegd"},null,null,null,null,null,{"$f":"IF('2.Vorderingsstaat'!$AC$6=TRUE,\"BTW verlegd\",BJ60+BD60)","v":"BTW verlegd"},null,null,null,null,null,{"$f":"IF(D60=\"\",0,IFERROR((SUM($AR$45:AW60,$D$45:I60)/$AC$15),0))","v":0}]
[null,17,null,null,null,null,null,null,null,null,null,{"$error":"#DIV/0!"},{"$error":"#DIV/0!"},{"$error":"#DIV/0!"},{"$error":"#DIV/0!"},0,0,null,null,null,null,null,0,null,null,null,null,null,{"$f":"IF('2.Vorderingsstaat'!$AC$6=TRUE,\"BTW verlegd\",W61*$BA$19)","v":"BTW verlegd"},null,null,null,null,null,{"$f":"IF('2.Vorderingsstaat'!$AC$6=TRUE,\"BTW verlegd\",AC61+W61)","v":"BTW verlegd"},null,null,null,null,null,null,17,null,null,null,null,null,null,null,null,null,null,null,null,null,0,null,null,null,null,null,{"$f":"IF('2.Vorderingsstaat'!$AC$6=TRUE,\"BTW verlegd\",BD61*$BA$19)","v":"BTW verlegd"},null,null,null,null,null,{"$f":"IF('2.Vorderingsstaat'!$AC$6=TRUE,\"BTW verlegd\",BJ61+BD61)","v":"BTW verlegd"},null,null,null,null,null,{"$f":"IF(D61=\"\",0,IFERROR((SUM($AR$45:AW61,$D$45:I61)/$AC$15),0))","v":0}]
[null,18,null,null,null,null,null,null,null,null,null,{"$error":"#DIV/0!"},{"$error":"#DIV/0!"},{"$error":"#DIV/0!"},{"$error":"#DIV/0!"},0,0,null,null,null,null,null,0,null,null,null,null,null,{"$f":"IF('2.Vorderingsstaat'!$AC$6=TRUE,\"BTW verlegd\",W62*$BA$19)","v":"BTW verlegd"},null,null,null,null,null,{"$f":"IF('2.Vorderingsstaat'!$AC$6=TRUE,\"BTW verlegd\",AC62+W62)","v":"BTW verlegd"},null,null,null,null,null,null,18,null,null,null,null,null,null,null,null,null,null,null,null,null,0,null,null,null,null,null,{"$f":"IF('2.Vorderingsstaat'!$AC$6=TRUE,\"BTW verlegd\",BD62*$BA$19)","v":"BTW verlegd"},null,null,null,null,null,{"$f":"IF('2.Vorderingsstaat'!$AC$6=TRUE,\"BTW verlegd\",BJ62+BD62)","v":"BTW verlegd"},null,null,null,null,null,{"$f":"IF(D62=\"\",0,IFERROR((SUM($AR$45:AW62,$D$45:I62)/$AC$15),0))","v":0}]
[null,19,null,null,null,null,null,null,null,null,null,{"$error":"#DIV/0!"},{"$error":"#DIV/0!"},{"$error":"#DIV/0!"},{"$error":"#DIV/0!"},0,0,null,null,null,null,null,0,null,null,null,null,null,{"$f":"IF('2.Vorderingsstaat'!$AC$6=TRUE,\"BTW verlegd\",W63*$BA$19)","v":"BTW verlegd"},null,null,null,null,null,{"$f":"IF('2.Vorderingsstaat'!$AC$6=TRUE,\"BTW verlegd\",AC63+W63)","v":"BTW verlegd"},null,null,null,null,null,null,19,null,null,null,null,null,null,null,null,null,null,null,null,null,0,null,null,null,null,null,{"$f":"IF('2.Vorderingsstaat'!$AC$6=TRUE,\"BTW verlegd\",BD63*$BA$19)","v":"BTW verlegd"},null,null,null,null,null,{"$f":"IF('2.Vorderingsstaat'!$AC$6=TRUE,\"BTW verlegd\",BJ63+BD63)","v":"BTW verlegd"},null,null,null,null,null,{"$f":"IF(D63=\"\",0,IFERROR((SUM($AR$45:AW63,$D$45:I63)/$AC$15),0))","v":0}]
[null,20,null,null,null,null,null,null,null,null,null,{"$error":"#DIV/0!"},{"$error":"#DIV/0!"},{"$error":"#DIV/0!"},{"$error":"#DIV/0!"},0,0,null,null,null,null,null,0,null,null,null,null,null,{"$f":"IF('2.Vorderingsstaat'!$AC$6=TRUE,\"BTW verlegd\",W64*$BA$19)","v":"BTW verlegd"},null,null,null,null,null,{"$f":"IF('2.Vorderingsstaat'!$AC$6=TRUE,\"BTW verlegd\",AC64+W64)","v":"BTW verlegd"},null,null,null,null,null,null,20,null,null,null,null,null,null,null,null,null,null,null,null,null,0,null,null,null,null,null,{"$f":"IF('2.Vorderingsstaat'!$AC$6=TRUE,\"BTW verlegd\",BD64*$BA$19)","v":"BTW verlegd"},null,null,null,null,null,{"$f":"IF('2.Vorderingsstaat'!$AC$6=TRUE,\"BTW verlegd\",BJ64+BD64)","v":"BTW verlegd"},null,null,null,null,null,{"$f":"IF(D64=\"\",0,IFERROR((SUM($AR$45:AW64,$D$45:I64)/$AC$15),0))","v":0}]
[null,21,null,null,null,null,null,null,null,null,null,{"$f":"(ROUND(J65/$BI$6,5))","v":{"$error":"#DIV/0!"}},{"$f":"(ROUND($BD$5*L65,5))","v":{"$error":"#DIV/0!"}},{"$f":"ROUND(K65/$BI$7,5)","v":{"$error":"#DIV/0!"}},{"$f":"ROUND($BJ$5*N65,5)","v":{"$error":"#DIV/0!"}},{"$f":"IF(AND(J65<>\"\",K65<>\"\"),ROUND(M65+O65+$BO$5,5),0)","v":0},{"$f":"IF(P65=0,0,(D65*P65)-D65)","v":0},null,null,null,null,null,{"$f":"D65+Q65","v":0},null,null,null,null,null,{"$f":"IF('2.Vorderingsstaat'!$AC$6=TRUE,\"BTW verlegd\",W65*$BA$19)","v":"BTW verlegd"},null,null,null,null,null,{"$f":"IF('2.Vorderingsstaat'!$AC$6=TRUE,\"BTW verlegd\",AC65+W65)","v":"BTW verlegd"},null,null,null,null,null,null,21,null,null,null,null,null,null,null,null,null,null,null,null,null,{"$f":"AR65+AX65","v":0},null,null,null,null,null,{"$f":"IF('2.Vorderingsstaat'!$AC$6=TRUE,\"BTW verlegd\",BD65*$BA$19)","v":"BTW verlegd"},null,null,null,null,null,{"$f":"IF('2.Vorderingsstaat'!$AC$6=TRUE,\"BTW verlegd\",BJ65+BD65)","v":"BTW verlegd"},null,null,null,null,null,{"$f":"IF(D65=\"\",0,IFERROR((SUM($AR$45:AW65,$D$45:I65)/$AC$15),0))","v":0}]
[null,22,null,null,null,null,null,null,null,null,null,{"$error":"#DIV/0!"},{"$error":"#DIV/0!"},{"$error":"#DIV/0!"},{"$error":"#DIV/0!"},0,0,null,null,null,null,null,0,null,null,null,null,null,{"$f":"IF('2.Vorderingsstaat'!$AC$6=TRUE,\"BTW verlegd\",W66*$BA$19)","v":"BTW verlegd"},null,null,null,null,null,{"$f":"IF('2.Vorderingsstaat'!$AC$6=TRUE,\"BTW verlegd\",AC66+W66)","v":"BTW verlegd"},null,null,null,null,null,null,22,null,null,null,null,null,null,null,null,null,null,null,null,null,0,null,null,null,null,null,{"$f":"IF('2.Vorderingsstaat'!$AC$6=TRUE,\"BTW verlegd\",BD66*$BA$19)","v":"BTW verlegd"},null,null,null,null,null,{"$f":"IF('2.Vorderingsstaat'!$AC$6=TRUE,\"BTW verlegd\",BJ66+BD66)","v":"BTW verlegd"},null,null,null,null,null,{"$f":"IF(D66=\"\",0,IFERROR((SUM($AR$45:AW66,$D$45:I66)/$AC$15),0))","v":0}]
[null,23,null,null,null,null,null,null,null,null,null,{"$error":"#DIV/0!"},{"$error":"#DIV/0!"},{"$error":"#DIV/0!"},{"$error":"#DIV/0!"},0,0,null,null,null,null,null,0,null,null,null,null,null,{"$f":"IF('2.Vorderingsstaat'!$AC$6=TRUE,\"BTW verlegd\",W67*$BA$19)","v":"BTW verlegd"},null,null,null,null,null,{"$f":"IF('2.Vorderingsstaat'!$AC$6=TRUE,\"BTW verlegd\",AC67+W67)","v":"BTW verlegd"},null,null,null,null,null,null,23,null,null,null,null,null,null,null,null,null,null,null,null,null,0,null,null,null,null,null,{"$f":"IF('2.Vorderingsstaat'!$AC$6=TRUE,\"BTW verlegd\",BD67*$BA$19)","v":"BTW verlegd"},null,null,null,null,null,{"$f":"IF('2.Vorderingsstaat'!$AC$6=TRUE,\"BTW verlegd\",BJ67+BD67)","v":"BTW verlegd"},null,null,null,null,null,{"$f":"IF(D67=\"\",0,IFERROR((SUM($AR$45:AW67,$D$45:I67)/$AC$15),0))","v":0}]
[null,24,null,null,null,null,null,null,null,null,null,{"$error":"#DIV/0!"},{"$error":"#DIV/0!"},{"$error":"#DIV/0!"},{"$error":"#DIV/0!"},0,0,null,null,null,null,null,0,null,null,null,null,null,{"$f":"IF('2.Vorderingsstaat'!$AC$6=TRUE,\"BTW verlegd\",W68*$BA$19)","v":"BTW verlegd"},null,null,null,null,null,{"$f":"IF('2.Vorderingsstaat'!$AC$6=TRUE,\"BTW verlegd\",AC68+W68)","v":"BTW verlegd"},null,null,null,null,null,null,24,null,null,null,null,null,null,null,null,null,null,null,null,null,0,null,null,null,null,null,{"$f":"IF('2.Vorderingsstaat'!$AC$6=TRUE,\"BTW verlegd\",BD68*$BA$19)","v":"BTW verlegd"},null,null,null,null,null,{"$f":"IF('2.Vorderingsstaat'!$AC$6=TRUE,\"BTW verlegd\",BJ68+BD68)","v":"BTW verlegd"},null,null,null,null,null,{"$f":"IF(D68=\"\",0,IFERROR((SUM($AR$45:AW68,$D$45:I68)/$AC$15),0))","v":0}]
[null,25,null,null,null,null,null,null,null,null,null,{"$error":"#DIV/0!"},{"$error":"#DIV/0!"},{"$error":"#DIV/0!"},{"$error":"#DIV/0!"},0,0,null,null,null,null,null,0,null,null,null,null,null,{"$f":"IF('2.Vorderingsstaat'!$AC$6=TRUE,\"BTW verlegd\",W69*$BA$19)","v":"BTW verlegd"},null,null,null,null,null,{"$f":"IF('2.Vorderingsstaat'!$AC$6=TRUE,\"BTW verlegd\",AC69+W69)","v":"BTW verlegd"},null,null,null,null,null,null,25,null,null,null,null,null,null,null,null,null,null,null,null,null,0,null,null,null,null,null,{"$f":"IF('2.Vorderingsstaat'!$AC$6=TRUE,\"BTW verlegd\",BD69*$BA$19)","v":"BTW verlegd"},null,null,null,null,null,{"$f":"IF('2.Vorderingsstaat'!$AC$6=TRUE,\"BTW verlegd\",BJ69+BD69)","v":"BTW verlegd"},null,null,null,null,null,{"$f":"IF(D69=\"\",0,IFERROR((SUM($AR$45:AW69,$D$45:I69)/$AC$15),0))","v":0}]
[null,26,null,null,null,null,null,null,null,null,null,{"$error":"#DIV/0!"},{"$error":"#DIV/0!"},{"$error":"#DIV/0!"},{"$error":"#DIV/0!"},0,0,null,null,null,null,null,0,null,null,null,null,null,{"$f":"IF('2.Vorderingsstaat'!$AC$6=TRUE,\"BTW verlegd\",W70*$BA$19)","v":"BTW verlegd"},null,null,null,null,null,{"$f":"IF('2.Vorderingsstaat'!$AC$6=TRUE,\"BTW verlegd\",AC70+W70)","v":"BTW verlegd"},null,null,null,null,null,null,26,null,null,null,null,null,null,null,null,null,null,null,null,null,0,null,null,null,null,null,{"$f":"IF('2.Vorderingsstaat'!$AC$6=TRUE,\"BTW verlegd\",BD70*$BA$19)","v":"BTW verlegd"},null,null,null,null,null,{"$f":"IF('2.Vorderingsstaat'!$AC$6=TRUE,\"BTW verlegd\",BJ70+BD70)","v":"BTW verlegd"},null,null,null,null,null,{"$f":"IF(D70=\"\",0,IFERROR((SUM($AR$45:AW70,$D$45:I70)/$AC$15),0))","v":0}]
[null,27,null,null,null,null,null,null,null,null,null,{"$error":"#DIV/0!"},{"$error":"#DIV/0!"},{"$error":"#DIV/0!"},{"$error":"#DIV/0!"},0,0,null,null,null,null,null,0,null,null,null,null,null,{"$f":"IF('2.Vorderingsstaat'!$AC$6=TRUE,\"BTW verlegd\",W71*$BA$19)","v":"BTW verlegd"},null,null,null,null,null,{"$f":"IF('2.Vorderingsstaat'!$AC$6=TRUE,\"BTW verlegd\",AC71+W71)","v":"BTW verlegd"},null,null,null,null,null,null,27,null,null,null,null,null,null,null,null,null,null,null,null,null,0,null,null,null,null,null,{"$f":"IF('2.Vorderingsstaat'!$AC$6=TRUE,\"BTW verlegd\",BD71*$BA$19)","v":"BTW verlegd"},null,null,null,null,null,{"$f":"IF('2.Vorderingsstaat'!$AC$6=TRUE,\"BTW verlegd\",BJ71+BD71)","v":"BTW verlegd"},null,null,null,null,null,{"$f":"IF(D71=\"\",0,IFERROR((SUM($AR$45:AW71,$D$45:I71)/$AC$15),0))","v":0}]
[null,28,null,null,null,null,null,null,null,null,null,{"$error":"#DIV/0!"},{"$error":"#DIV/0!"},{"$error":"#DIV/0!"},{"$error":"#DIV/0!"},0,0,null,null,null,null,null,0,null,null,null,null,null,{"$f":"IF('2.Vorderingsstaat'!$AC$6=TRUE,\"BTW verlegd\",W72*$BA$19)","v":"BTW verlegd"},null,null,null,null,null,{"$f":"IF('2.Vorderingsstaat'!$AC$6=TRUE,\"BTW verlegd\",AC72+W72)","v":"BTW verlegd"},null,null,null,null,null,null,28,null,null,null,null,null,null,null,null,null,null,null,null,null,0,null,null,null,null,null,{"$f":"IF('2.Vorderingsstaat'!$AC$6=TRUE,\"BTW verlegd\",BD72*$BA$19)","v":"BTW verlegd"},null,null,null,null,null,{"$f":"IF('2.Vorderingsstaat'!$AC$6=TRUE,\"BTW verlegd\",BJ72+BD72)","v":"BTW verlegd"},null,null,null,null,null,{"$f":"IF(D72=\"\",0,IFERROR((SUM($AR$45:AW72,$D$45:I72)/$AC$15),0))","v":0}]
[null,29,null,null,null,null,null,null,null,null,null,{"$error":"#DIV/0!"},{"$error":"#DIV/0!"},{"$error":"#DIV/0!"},{"$error":"#DIV/0!"},0,0,null,null,null,null,null,0,null,null,null,null,null,{"$f":"IF('2.Vorderingsstaat'!$AC$6=TRUE,\"BTW verlegd\",W73*$BA$19)","v":"BTW verlegd"},null,null,null,null,null,{"$f":"IF('2.Vorderingsstaat'!$AC$6=TRUE,\"BTW verlegd\",AC73+W73)","v":"BTW verlegd"},null,null,null,null,null,null,29,null,null,null,null,null,null,null,null,null,null,null,null,null,0,null,null,null,null,null,{"$f":"IF('2.Vorderingsstaat'!$AC$6=TRUE,\"BTW verlegd\",BD73*$BA$19)","v":"BTW verlegd"},null,null,null,null,null,{"$f":"IF('2.Vorderingsstaat'!$AC$6=TRUE,\"BTW verlegd\",BJ73+BD73)","v":"BTW verlegd"},null,null,null,null,null,{"$f":"IF(D73=\"\",0,IFERROR((SUM($AR$45:AW73,$D$45:I73)/$AC$15),0))","v":0}]
[null,30,null,null,null,null,null,null,null,null,null,{"$error":"#DIV/0!"},{"$error":"#DIV/0!"},{"$error":"#DIV/0!"},{"$error":"#DIV/0!"},0,0,null,null,null,null,null,0,null,null,null,null,null,{"$f":"IF('2.Vorderingsstaat'!$AC$6=TRUE,\"BTW verlegd\",W74*$BA$19)","v":"BTW verlegd"},null,null,null,null,null,{"$f":"IF('2.Vorderingsstaat'!$AC$6=TRUE,\"BTW verlegd\",AC74+W74)","v":"BTW verlegd"},null,null,null,null,null,null,30,null,null,null,null,null,null,null,null,null,null,null,null,null,0,null,null,null,null,null,{"$f":"IF('2.Vorderingsstaat'!$AC$6=TRUE,\"BTW verlegd\",BD74*$BA$19)","v":"BTW verlegd"},null,null,null,null,null,{"$f":"IF('2.Vorderingsstaat'!$AC$6=TRUE,\"BTW verlegd\",BJ74+BD74)","v":"BTW verlegd"},null,null,null,null,null,{"$f":"IF(D74=\"\",0,IFERROR((SUM($AR$45:AW74,$D$45:I74)/$AC$15),0))","v":0}]
[]
[null,"OVERZICHT VORDERINGSSTATEN DEEL GEMEENSCHAPPELIJK"]
[null,"Overzicht vorderingsstaten deel A",null,null,null,null,null,null,null,null,null,null,null,null,null,null,null,null,null,null,null,null,null,null,null,null,null,null,null,null,null,null,null,null,null,null,null,null,null,null,null,"Overzicht vorderingsstaten deel B",null,null,null,null,null,null,null,null,null,null,null,null,null,null,null,null,null,null,null,null,null,null,null,null,null,null,null,null,null,null,null,"Vorderings %\n(excl.BTW)"]
[null,"Nr.",null,"Te herzien bedrag",null,null,null,null,null,"s","i","s/S","a*(s/S)","i/I","b*(i/I)","p","Herzieningsbedrag",null,null,null,null,null,"Bedrag excl. BTW",null,null,null,null,null,null,null,null,null,null,null,null,null,null,null,null,null,null,"Nr.",null,"Te herzien bedrag",null,null,null,null,null,"Herzieningsbedrag",null,null,null,null,null,"Bedrag excl. BTW"]
[null,"Tot.",null,{"$f":"SUM(D81:I110)","v":0},{"$f":"IFERROR(IF(SUM(E85:E1084)<>0,SUM(E85:E1084),\"\"),\"\")","v":""},{"$f":"IFERROR(IF(SUM(F85:F1084)<>0,SUM(F85:F1084),\"\"),\"\")","v":""},{"$f":"IFERROR(IF(SUM(G85:G1084)<>0,SUM(G85:G1084),\"\"),\"\")","v":""},{"$f":"IFERROR(IF(SUM(H85:H1084)<>0,SUM(H85:H1084),\"\"),\"\")","v":""},{"$f":"IFERROR(IF(SUM(I85:I1084)<>0,SUM(I85:I1084),\"\"),\"\")","v":""},null,null,null,null,null,null,null,{"$f":"SUM(Q81:V110)","v":0},{"$f":"IFERROR(IF(SUM(R85:R1084)<>0,SUM(R85:R1084),\"\"),\"\")","v":""},{"$f":"IFERROR(IF(SUM(S85:S1084)<>0,SUM(S85:S1084),\"\"),\"\")","v":""},{"$f":"IFERROR(IF(SUM(T85:T1084)<>0,SUM(T85:T1084),\"\"),\"\")","v":""},{"$f":"IFERROR(IF(SUM(U85:U1084)<>0,SUM(U85:U1084),\"\"),\"\")","v":""},{"$f":"IFERROR(IF(SUM(V85:V1084)<>0,SUM(V85:V1084),\"\"),\"\")","v":""},{"$f":"SUM(W81:AB110)","v":0},{"$f":"IFERROR(IF(SUM(X85:X1084)<>0,SUM(X85:X1084),\"\"),\"\")","v":""},{"$f":"IFERROR(IF(SUM(Y85:Y1084)<>0,SUM(Y85:Y1084),\"\"),\"\")","v":""},{"$f":"IFERROR(IF(SUM(Z85:Z1084)<>0,SUM(Z85:Z1084),\"\"),\"\")","v":""},{"$f":"IFERROR(IF(SUM(AA85:AA1084)<>0,SUM(AA85:AA1084),\"\"),\"\")","v":""},{"$f":"IFERROR(IF(SUM(AB85:AB1084)<>0,SUM(AB85:AB1084),\"\"),\"\")","v":""},null,null,null,null,null,null,null,null,null,null,null,null,null,"Tot.",null,{"$f":"SUM(AR81:AW110)","v":0},{"$f":"IFERROR(IF(SUM(AS85:AS1084)<>0,SUM(AS85:AS1084),\"\"),\"\")","v":""},{"$f":"IFERROR(IF(SUM(AT85:AT1084)<>0,SUM(AT85:AT1084),\"\"),\"\")","v":""},{"$f":"IFERROR(IF(SUM(AU85:AU1084)<>0,SUM(AU85:AU1084),\"\"),\"\")","v":""},{"$f":"IFERROR(IF(SUM(AV85:AV1084)<>0,SUM(AV85:AV1084),\"\"),\"\")","v":""},{"$f":"IFERROR(IF(SUM(AW85:AW1084)<>0,SUM(AW85:AW1084),\"\"),\"\")","v":""},{"$f":"SUM(AX81:BC110)","v":0},{"$f":"IFERROR(IF(SUM(AY85:AY1084)<>0,SUM(AY85:AY1084),\"\"),\"\")","v":""},{"$f":"IFERROR(IF(SUM(AZ85:AZ1084)<>0,SUM(AZ85:AZ1084),\"\"),\"\")","v":""},{"$f":"IFERROR(IF(SUM(BA85:BA1084)<>0,SUM(BA85:BA1084),\"\"),\"\")","v":""},{"$f":"IFERROR(IF(SUM(BB85:BB1084)<>0,SUM(BB85:BB1084),\"\"),\"\")","v":""},{"$f":"IFERROR(IF(SUM(BC85:BC1084)<>0,SUM(BC85:BC1084),\"\"),\"\")","v":""},{"$f":"SUM(BD81:BI110)","v":0},{"$f":"IFERROR(IF(SUM(BE85:BE1084)<>0,SUM(BE85:BE1084),\"\"),\"\")","v":""},{"$f":"IFERROR(IF(SUM(BF85:BF1084)<>0,SUM(BF85:BF1084),\"\"),\"\")","v":""},{"$f":"IFERROR(IF(SUM(BG85:BG1084)<>0,SUM(BG85:BG1084),\"\"),\"\")","v":""},{"$f":"IFERROR(IF(SUM(BH85:BH1084)<>0,SUM(BH85:BH1084),\"\"),\"\")","v":""},{"$f":"IFERROR(IF(SUM(BI85:BI1084)<>0,SUM(BI85:BI1084),\"\"),\"\")","v":""}]
[null,0,null,0,null,null,null,null,null,null,null,null,null,null,null,null,0,null,null,null,null,null,0,null,null,null,null,null,null,null,null,null,null,null,null,null,null,null,null,null,null,0,null,0,null,null,null,null,null,0,null,null,null,null,null,0]
[null,1,null,null,null,null,null,null,null,null,null,{"$f":"(ROUND(J81/$BI$6,5))","v":{"$error":"#DIV/0!"}},{"$f":"(ROUND($BD$5*L81,5))","v":{"$error":"#DIV/0!"}},{"$f":"ROUND(K81/$BI$7,5)","v":{"$error":"#DIV/0!"}},{"$f":"ROUND($BJ$5*N81,5)","v":{"$error":"#DIV/0!"}},{"$f":"IF(AND(J81<>\"\",K81<>\"\"),ROUND(M81+O81+$BO$5,5),0)","v":0},{"$f":"IF(P81=0,0,(D81*P81)-D81)","v":0},null,null,null,null,null,{"$f":"D81+Q81","v":0},null,null,null,null,null,null,null,null,null,null,null,null,null,null,null,null,null,null,1,null,null,null,null,null,null,null,null,null,null,null,null,null,{"$f":"AR81+AX81","v":0},null,null,null,null,null,null,null,null,null,null,null,null,null,null,null,null,null,{"$f":"IF(D81=\"\",0,IFERROR((D81+AR81)/$AC$23,0))","v":0}]
[null,2,null,null,null,null,null,null,null,null,null,{"$f":"(ROUND(J82/$BI$6,5))","v":{"$error":"#DIV/0!"}},{"$f":"(ROUND($BD$5*L82,5))","v":{"$error":"#DIV/0!"}},{"$f":"ROUND(K82/$BI$7,5)","v":{"$error":"#DIV/0!"}},{"$f":"ROUND($BJ$5*N82,5)","v":{"$error":"#DIV/0!"}},{"$f":"IF(AND(J82<>\"\",K82<>\"\"),ROUND(M82+O82+$BO$5,5),0)","v":0},{"$f":"IF(P82=0,0,(D82*P82)-D82)","v":0},null,null,null,null,null,{"$f":"D82+Q82","v":0},null,null,null,null,null,null,null,null,null,null,null,null,null,null,null,null,null,null,2,null,null,null,null,null,null,null,null,null,null,null,null,null,{"$f":"AR82+AX82","v":0},null,null,null,null,null,null,null,null,null,null,null,null,null,null,null,null,null,{"$f":"IF(D82=\"\",0,IFERROR((SUM($AR$81:AW82,$D$81:I82)/$AC$23),0))","v":0}]
[null,3,null,null,null,null,null,null,null,null,null,{"$error":"#DIV/0!"},{"$error":"#DIV/0!"},{"$error":"#DIV/0!"},{"$error":"#DIV/0!"},0,0,null,null,null,null,null,0,null,null,null,null,null,null,null,null,null,null,null,null,null,null,null,null,null,null,3,null,null,null,null,null,null,null,null,null,null,null,null,null,0,null,null,null,null,null,null,null,null,null,null,null,null,null,null,null,null,null,{"$f":"IF(D83=\"\",0,IFERROR((SUM($AR$81:AW83,$D$81:I83)/$AC$23),0))","v":0}]
[null,4,null,null,null,null,null,null,null,null,null,{"$error":"#DIV/0!"},{"$error":"#DIV/0!"},{"$error":"#DIV/0!"},{"$error":"#DIV/0!"},0,0,null,null,null,null,null,0,null,null,null,null,null,null,null,null,null,null,null,null,null,null,null,null,null,null,4,null,null,null,null,null,null,null,null,null,null,null,null,null,0,null,null,null,null,null,null,null,null,null,null,null,null,null,null,null,null,null,{"$f":"IF(D84=\"\",0,IFERROR((SUM($AR$81:AW84,$D$81:I84)/$AC$23),0))","v":0}]
[null,5,null,null,null,null,null,null,null,null,null,{"$error":"#DIV/0!"},{"$error":"#DIV/0!"},{"$error":"#DIV/0!"},{"$error":"#DIV/0!"},0,0,null,null,null,null,null,0,null,null,null,null,null,null,null,null,null,null,null,null,null,null,null,null,null,null,5,null,null,null,null,null,null,null,null,null,null,null,null,null,0,null,null,null,null,null,null,null,null,null,null,null,null,null,null,null,null,null,{"$f":"IF(D85=\"\",0,IFERROR((SUM($AR$81:AW85,$D$81:I85)/$AC$23),0))","v":0}]
[null,6,null,null,null,null,null,null,null,null,null,{"$error":"#DIV/0!"},{"$error":"#DIV/0!"},{"$error":"#DIV/0!"},{"$error":"#DIV/0!"},0,0,null,null,null,null,null,0,null,null,null,null,null,null,null,null,null,null,null,null,null,null,null,null,null,null,6,null,null,null,null,null,null,null,null,null,null,null,null,null,0,null,null,null,null,null,null,null,null,null,null,null,null,null,null,null,null,null,{"$f":"IF(D86=\"\",0,IFERROR((SUM($AR$81:AW86,$D$81:I86)/$AC$23),0))","v":0}]
[null,7,null,null,null,null,null,null,null,null,null,{"$error":"#DIV/0!"},{"$error":"#DIV/0!"},{"$error":"#DIV/0!"},{"$error":"#DIV/0!"},0,0,null,null,null,null,null,0,null,null,null,null,null,null,null,null,null,null,null,null,null,null,null,null,null,null,7,null,null,null,null,null,null,null,null,null,null,null,null,null,0,null,null,null,null,null,null,null,null,null,null,null,null,null,null,null,null,null,{"$f":"IF(D87=\"\",0,IFERROR((SUM($AR$81:AW87,$D$81:I87)/$AC$23),0))","v":0}]
[null,8,null,null,null,null,null,null,null,null,null,{"$error":"#DIV/0!"},{"$error":"#DIV/0!"},{"$error":"#DIV/0!"},{"$error":"#DIV/0!"},0,0,null,null,null,null,null,0,null,null,null,null,null,null,null,null,null,null,null,null,null,null,null,null,null,null,8,null,null,null,null,null,null,null,null,null,null,null,null,null,0,null,null,null,null,null,null,null,null,null,null,null,null,null,null,null,null,null,{"$f":"IF(D88=\"\",0,IFERROR((SUM($AR$81:AW88,$D$81:I88)/$AC$23),0))","v":0}]
[null,9,null,null,null,null,null,null,null,null,null,{"$error":"#DIV/0!"},{"$error":"#DIV/0!"},{"$error":"#DIV/0!"},{"$error":"#DIV/0!"},0,0,null,null,null,null,null,0,null,null,null,null,null,null,null,null,null,null,null,null,null,null,null,null,null,null,9,null,null,null,null,null,null,null,null,null,null,null,null,null,0,null,null,null,null,null,null,null,null,null,null,null,null,null,null,null,null,null,{"$f":"IF(D89=\"\",0,IFERROR((SUM($AR$81:AW89,$D$81:I89)/$AC$23),0))","v":0}]
[null,10,null,null,null,null,null,null,null,null,null,{"$error":"#DIV/0!"},{"$error":"#DIV/0!"},{"$error":"#DIV/0!"},{"$error":"#DIV/0!"},0,0,null,null,null,null,null,0,null,null,null,null,null,null,null,null,null,null,null,null,null,null,null,null,null,null,10,null,null,null,null,null,null,null,null,null,null,null,null,null,0,null,null,null,null,null,null,null,null,null,null,null,null,null,null,null,null,null,{"$f":"IF(D90=\"\",0,IFERROR((SUM($AR$81:AW90,$D$81:I90)/$AC$23),0))","v":0}]
[null,11,null,null,null,null,null,null,null,null,null,{"$error":"#DIV/0!"},{"$error":"#DIV/0!"},{"$error":"#DIV/0!"},{"$error":"#DIV/0!"},0,0,null,null,null,null,null,0,null,null,null,null,null,null,null,null,null,null,null,null,null,null,null,null,null,null,11,null,null,null,null,null,null,null,null,null,null,null,null,null,0,null,null,null,null,null,null,null,null,null,null,null,null,null,null,null,null,null,{"$f":"IF(D91=\"\",0,IFERROR((SUM($AR$81:AW91,$D$81:I91)/$AC$23),0))","v":0}]
[null,12,null,null,null,null,null,null,null,null,null,{"$error":"#DIV/0!"},{"$error":"#DIV/0!"},{"$error":"#DIV/0!"},{"$error":"#DIV/0!"},0,0,null,null,null,null,null,0,null,null,null,null,null,null,null,null,null,null,null,null,null,null,null,null,null,null,12,null,null,null,null,null,null,null,null,null,null,null,null,null,0,null,null,null,null,null,null,null,null,null,null,null,null,null,null,null,null,null,{"$f":"IF(D92=\"\",0,IFERROR((SUM($AR$81:AW92,$D$81:I92)/$AC$23),0))","v":0}]
[null,13,null,null,null,null,null,null,null,null,null,{"$error":"#DIV/0!"},{"$error":"#DIV/0!"},{"$error":"#DIV/0!"},{"$error":"#DIV/0!"},0,0,null,null,null,null,null,0,null,null,null,null,null,null,null,null,null,null,null,null,null,null,null,null,null,null,13,null,null,null,null,null,null,null,null,null,null,null,null,null,0,null,null,null,null,null,null,null,null,null,null,null,null,null,null,null,null,null,{"$f":"IF(D93=\"\",0,IFERROR((SUM($AR$81:AW93,$D$81:I93)/$AC$23),0))","v":0}]
[null,14,null,null,null,null,null,null,null,null,null,{"$error":"#DIV/0!"},{"$error":"#DIV/0!"},{"$error":"#DIV/0!"},{"$error":"#DIV/0!"},0,0,null,null,null,null,null,0,null,null,null,null,null,null,null,null,null,null,null,null,null,null,null,null,null,null,14,null,null,null,null,null,null,null,null,null,null,null,null,null,0,null,null,null,null,null,null,null,null,null,null,null,null,null,null,null,null,null,{"$f":"IF(D94=\"\",0,IFERROR((SUM($AR$81:AW94,$D$81:I94)/$AC$23),0))","v":0}]
[null,15,null,null,null,null,null,null,null,null,null,{"$error":"#DIV/0!"},{"$error":"#DIV/0!"},{"$error":"#DIV/0!"},{"$error":"#DIV/0!"},0,0,null,null,null,null,null,0,null,null,null,null,null,null,null,null,null,null,null,null,null,null,null,null,null,null,15,null,null,null,null,null,null,null,null,null,null,null,null,null,0,null,null,null,null,null,null,null,null,null,null,null,null,null,null,null,null,null,{"$f":"IF(D95=\"\",0,IFERROR((SUM($AR$81:AW95,$D$81:I95)/$AC$23),0))","v":0}]
[null,16,null,null,null,null,null,null,null,null,null,{"$error":"#DIV/0!"},{"$error":"#DIV/0!"},{"$error":"#DIV/0!"},{"$error":"#DIV/0!"},0,0,null,null,null,null,null,0,null,null,null,null,null,null,null,null,null,null,null,null,null,null,null,null,null,null,16,null,null,null,null,null,null,null,null,null,null,null,null,null,0,null,null,null,null,null,null,null,null,null,null,null,null,null,null,null,null,null,{"$f":"IF(D96=\"\",0,IFERROR((SUM($AR$81:AW96,$D$81:I96)/$AC$23),0))","v":0}]
[null,17,null,null,null,null,null,null,null,null,null,{"$error":"#DIV/0!"},{"$error":"#DIV/0!"},{"$error":"#DIV/0!"},{"$error":"#DIV/0!"},0,0,null,null,null,null,null,0,null,null,null,null,null,null,null,null,null,null,null,null,null,null,null,null,null,null,17,null,null,null,null,null,null,null,null,null,null,null,null,null,0,null,null,null,null,null,null,null,null,null,null,null,null,null,null,null,null,null,{"$f":"IF(D97=\"\",0,IFERROR((SUM($AR$81:AW97,$D$81:I97)/$AC$23),0))","v":0}]
[null,18,null,null,null,null,null,null,null,null,null,{"$error":"#DIV/0!"},{"$error":"#DIV/0!"},{"$error":"#DIV/0!"},{"$error":"#DIV/0!"},0,0,null,null,null,null,null,0,null,null,null,null,null,null,null,null,null,null,null,null,null,null,null,null,null,null,18,null,null,null,null,null,null,null,null,null,null,null,null,null,0,null,null,null,null,null,null,null,null,null,null,null,null,null,null,null,null,null,{"$f":"IF(D98=\"\",0,IFERROR((SUM($AR$81:AW98,$D$81:I98)/$AC$23),0))","v":0}]
[null,19,null,null,null,null,null,null,null,null,null,{"$error":"#DIV/0!"},{"$error":"#DIV/0!"},{"$error":"#DIV/0!"},{"$error":"#DIV/0!"},0,0,null,null,null,null,null,0,null,null,null,null,null,null,null,null,null,null,null,null,null,null,null,null,null,null,19,null,null,null,null,null,null,null,null,null,null,null,null,null,0,null,null,null,null,null,null,null,null,null,null,null,null,null,null,null,null,null,{"$f":"IF(D99=\"\",0,IFERROR((SUM($AR$81:AW99,$D$81:I99)/$AC$23),0))","v":0}]
[null,20,null,null,null,null,null,null,null,null,null,{"$error":"#DIV/0!"},{"$error":"#DIV/0!"},{"$error":"#DIV/0!"},{"$error":"#DIV/0!"},0,0,null,null,null,null,null,0,null,null,null,null,null,null,null,null,null,null,null,null,null,null,null,null,null,null,20,null,null,null,null,null,null,null,null,null,null,null,null,null,0,null,null,null,null,null,null,null,null,null,null,null,null,null,null,null,null,null,{"$f":"IF(D100=\"\",0,IFERROR((SUM($AR$81:AW100,$D$81:I100)/$AC$23),0))","v":0}]
[null,21,null,null,null,null,null,null,null,null,null,{"$f":"(ROUND(J101/$BI$6,5))","v":{"$error":"#DIV/0!"}},{"$f":"(ROUND($BD$5*L101,5))","v":{"$error":"#DIV/0!"}},{"$f":"ROUND(K101/$BI$7,5)","v":{"$error":"#DIV/0!"}},{"$f":"ROUND($BJ$5*N101,5)","v":{"$error":"#DIV/0!"}},{"$f":"IF(AND(J101<>\"\",K101<>\"\"),ROUND(M101+O101+$BO$5,5),0)","v":0},{"$f":"IF(P101=0,0,(D101*P101)-D101)","v":0},null,null,null,null,null,{"$f":"D101+Q101","v":0},null,null,null,null,null,null,null,null,null,null,null,null,null,null,null,null,null,null,21,null,null,null,null,null,null,null,null,null,null,null,null,null,{"$f":"AR101+AX101","v":0},null,null,null,null,null,null,null,null,null,null,null,null,null,null,null,null,null,{"$f":"IF(D101=\"\",0,IFERROR((SUM($AR$81:AW101,$D$81:I101)/$AC$23),0))","v":0}]
[null,22,null,null,null,null,null,null,null,null,null,{"$error":"#DIV/0!"},{"$error":"#DIV/0!"},{"$error":"#DIV/0!"},{"$error":"#DIV/0!"},0,0,null,null,null,null,null,0,null,null,null,null,null,null,null,null,null,null,null,null,null,null,null,null,null,null,22,null,null,null,null,null,null,null,null,null,null,null,null,null,0,null,null,null,null,null,null,null,null,null,null,null,null,null,null,null,null,null,{"$f":"IF(D102=\"\",0,IFERROR((SUM($AR$81:AW102,$D$81:I102)/$AC$23),0))","v":0}]
[null,23,null,null,null,null,null,null,null,null,null,{"$error":"#DIV/0!"},{"$error":"#DIV/0!"},{"$error":"#DIV/0!"},{"$error":"#DIV/0!"},0,0,null,null,null,null,null,0,null,null,null,null,null,null,null,null,null,null,null,null,null,null,null,null,null,null,23,null,null,null,null,null,null,null,null,null,null,null,null,null,0,null,null,null,null,null,null,null,null,null,null,null,null,null,null,null,null,null,{"$f":"IF(D103=\"\",0,IFERROR((SUM($AR$81:AW103,$D$81:I103)/$AC$23),0))","v":0}]
[null,24,null,null,null,null,null,null,null,null,null,{"$error":"#DIV/0!"},{"$error":"#DIV/0!"},{"$error":"#DIV/0!"},{"$error":"#DIV/0!"},0,0,null,null,null,null,null,0,null,null,null,null,null,null,null,null,null,null,null,null,null,null,null,null,null,null,24,null,null,null,null,null,null,null,null,null,null,null,null,null,0,null,null,null,null,null,null,null,null,null,null,null,null,null,null,null,null,null,{"$f":"IF(D104=\"\",0,IFERROR((SUM($AR$81:AW104,$D$81:I104)/$AC$23),0))","v":0}]
[null,25,null,null,null,null,null,null,null,null,null,{"$error":"#DIV/0!"},{"$error":"#DIV/0!"},{"$error":"#DIV/0!"},{"$error":"#DIV/0!"},0,0,null,null,null,null,null,0,null,null,null,null,null,null,null,null,null,null,null,null,null,null,null,null,null,null,25,null,null,null,null,null,null,null,null,null,null,null,null,null,0,null,null,null,null,null,null,null,null,null,null,null,null,null,null,null,null,null,{"$f":"IF(D105=\"\",0,IFERROR((SUM($AR$81:AW105,$D$81:I105)/$AC$23),0))","v":0}]
[null,26,null,null,null,null,null,null,null,null,null,{"$error":"#DIV/0!"},{"$error":"#DIV/0!"},{"$error":"#DIV/0!"},{"$error":"#DIV/0!"},0,0,null,null,null,null,null,0,null,null,null,null,null,null,null,null,null,null,null,null,null,null,null,null,null,null,26,null,null,null,null,null,null,null,null,null,null,null,null,null,0,null,null,null,null,null,null,null,null,null,null,null,null,null,null,null,null,null,{"$f":"IF(D106=\"\",0,IFERROR((SUM($AR$81:AW106,$D$81:I106)/$AC$23),0))","v":0}]
[null,27,null,null,null,null,null,null,null,null,null,{"$error":"#DIV/0!"},{"$error":"#DIV/0!"},{"$error":"#DIV/0!"},{"$error":"#DIV/0!"},0,0,null,null,null,null,null,0,null,null,null,null,null,null,null,null,null,null,null,null,null,null,null,null,null,null,27,null,null,null,null,null,null,null,null,null,null,null,null,null,0,null,null,null,null,null,null,null,null,null,null,null,null,null,null,null,null,null,{"$f":"IF(D107=\"\",0,IFERROR((SUM($AR$81:AW107,$D$81:I107)/$AC$23),0))","v":0}]
[null,28,null,null,null,null,null,null,null,null,null,{"$error":"#DIV/0!"},{"$error":"#DIV/0!"},{"$error":"#DIV/0!"},{"$error":"#DIV/0!"},0,0,null,null,null,null,null,0,null,null,null,null,null,null,null,null,null,null,null,null,null,null,null,null,null,null,28,null,null,null,null,null,null,null,null,null,null,null,null,null,0,null,null,null,null,null,null,null,null,null,null,null,null,null,null,null,null,null,{"$f":"IF(D108=\"\",0,IFERROR((SUM($AR$81:AW108,$D$81:I108)/$AC$23),0))","v":0}]
[null,29,null,null,null,null,null,null,null,null,null,{"$error":"#DIV/0!"},{"$error":"#DIV/0!"},{"$error":"#DIV/0!"},{"$error":"#DIV/0!"},0,0,null,null,null,null,null,0,null,null,null,null,null,null,null,null,null,null,null,null,null,null,null,null,null,null,29,null,null,null,null,null,null,null,null,null,null,null,null,null,0,null,null,null,null,null,null,null,null,null,null,null,null,null,null,null,null,null,{"$f":"IF(D109=\"\",0,IFERROR((SUM($AR$81:AW109,$D$81:I109)/$AC$23),0))","v":0}]
[null,30,null,null,null,null,null,null,null,null,null,{"$error":"#DIV/0!"},{"$error":"#DIV/0!"},{"$error":"#DIV/0!"},{"$error":"#DIV/0!"},0,0,null,null,null,null,null,0,null,null,null,null,null,null,null,null,null,null,null,null,null,null,null,null,null,null,30,null,null,null,null,null,null,null,null,null,null,null,null,null,0,null,null,null,null,null,null,null,null,null,null,null,null,null,null,null,null,null,{"$f":"IF(D110=\"\",0,IFERROR((SUM($AR$81:AW110,$D$81:I110)/$AC$23),0))","v":0}]
[]
[null,"OVERZICHT VORDERINGSSTATEN DEEL Derden"]
[null,"Overzicht vorderingsstaten deel A",null,null,null,null,null,null,null,null,null,null,null,null,null,null,null,null,null,null,null,null,null,null,null,null,null,null,null,null,null,null,null,null,null,null,null,null,null,null,null,"Overzicht vorderingsstaten deel B",null,null,null,null,null,null,null,null,null,null,null,null,null,null,null,null,null,null,null,null,null,null,null,null,null,null,null,null,null,null,null,"Vorderings %\n(excl.BTW)"]
[null,"Nr.",null,"Te herzien bedrag",null,null,null,null,null,"s","i","s/S","a*(s/S)","i/I","b*(i/I)","p","Herzieningsbedrag",null,null,null,null,null,"Bedrag excl. BTW",null,null,null,null,null,"BTW",null,null,null,null,null,"Bedrag incl BTW",null,null,null,null,null,null,"Nr.",null,"Te herzien bedrag",null,null,null,null,null,"Herzieningsbedrag",null,null,null,null,null,"Bedrag excl. BTW",null,null,null,null,null,"BTW",null,null,null,null,null,"Bedrag incl BTW"]
[null,"Tot.",null,{"$f":"SUM(D117:I146)","v":0},{"$f":"IFERROR(IF(SUM(E121:E1110)<>0,SUM(E121:E1110),\"\"),\"\")","v":""},{"$f":"IFERROR(IF(SUM(F121:F1110)<>0,SUM(F121:F1110),\"\"),\"\")","v":""},{"$f":"IFERROR(IF(SUM(G121:G1110)<>0,SUM(G121:G1110),\"\"),\"\")","v":""},{"$f":"IFERROR(IF(SUM(H121:H1110)<>0,SUM(H121:H1110),\"\"),\"\")","v":""},{"$f":"IFERROR(IF(SUM(I121:I1110)<>0,SUM(I121:I1110),\"\"),\"\")","v":""},null,null,null,null,null,null,null,{"$f":"SUM(Q117:V146)","v":0},{"$f":"IFERROR(IF(SUM(R121:R1110)<>0,SUM(R121:R1110),\"\"),\"\")","v":""},{"$f":"IFERROR(IF(SUM(S121:S1110)<>0,SUM(S121:S1110),\"\"),\"\")","v":""},{"$f":"IFERROR(IF(SUM(T121:T1110)<>0,SUM(T121:T1110),\"\"),\"\")","v":""},{"$f":"IFERROR(IF(SUM(U121:U1110)<>0,SUM(U121:U1110),\"\"),\"\")","v":""},{"$f":"IFERROR(IF(SUM(V121:V1110)<>0,SUM(V121:V1110),\"\"),\"\")","v":""},{"$f":"SUM(W117:AB146)","v":0},{"$f":"IFERROR(IF(SUM(X121:X1110)<>0,SUM(X121:X1110),\"\"),\"\")","v":""},{"$f":"IFERROR(IF(SUM(Y121:Y1110)<>0,SUM(Y121:Y1110),\"\"),\"\")","v":""},{"$f":"IFERROR(IF(SUM(Z121:Z1110)<>0,SUM(Z121:Z1110),\"\"),\"\")","v":""},{"$f":"IFERROR(IF(SUM(AA121:AA1110)<>0,SUM(AA121:AA1110),\"\"),\"\")","v":""},{"$f":"IFERROR(IF(SUM(AB121:AB1110)<>0,SUM(AB121:AB1110),\"\"),\"\")","v":""},{"$f":"SUM(AC117:AH146)","v":0},{"$f":"IFERROR(IF(SUM(AD121:AD1110)<>0,SUM(AD121:AD1110),\"\"),\"\")","v":""},{"$f":"IFERROR(IF(SUM(AE121:AE1110)<>0,SUM(AE121:AE1110),\"\"),\"\")","v":""},{"$f":"IFERROR(IF(SUM(AF121:AF1110)<>0,SUM(AF121:AF1110),\"\"),\"\")","v":""},{"$f":"IFERROR(IF(SUM(AG121:AG1110)<>0,SUM(AG121:AG1110),\"\"),\"\")","v":""},{"$f":"IFERROR(IF(SUM(AH121:AH1110)<>0,SUM(AH121:AH1110),\"\"),\"\")","v":""},{"$f":"SUM(AI117:AN146)","v":0},{"$f":"IFERROR(IF(SUM(AJ121:AJ1110)<>0,SUM(AJ121:AJ1110),\"\"),\"\")","v":""},{"$f":"IFERROR(IF(SUM(AK121:AK1110)<>0,SUM(AK121:AK1110),\"\"),\"\")","v":""},{"$f":"IFERROR(IF(SUM(AL121:AL1110)<>0,SUM(AL121:AL1110),\"\"),\"\")","v":""},{"$f":"IFERROR(IF(SUM(AM121:AM1110)<>0,SUM(AM121:AM1110),\"\"),\"\")","v":""},{"$f":"IFERROR(IF(SUM(AN121:AN1110)<>0,SUM(AN121:AN1110),\"\"),\"\")","v":""},null,"Tot.",null,{"$f":"SUM(AR117:AW146)","v":0},{"$f":"IFERROR(IF(SUM(AS121:AS1110)<>0,SUM(AS121:AS1110),\"\"),\"\")","v":""},{"$f":"IFERROR(IF(SUM(AT121:AT1110)<>0,SUM(AT121:AT1110),\"\"),\"\")","v":""},{"$f":"IFERROR(IF(SUM(AU121:AU1110)<>0,SUM(AU121:AU1110),\"\"),\"\")","v":""},{"$f":"IFERROR(IF(SUM(AV121:AV1110)<>0,SUM(AV121:AV1110),\"\"),\"\")","v":""},{"$f":"IFERROR(IF(SUM(AW121:AW1110)<>0,SUM(AW121:AW1110),\"\"),\"\")","v":""},{"$f":"SUM(AX117:BC146)","v":0},{"$f":"IFERROR(IF(SUM(AY121:AY1110)<>0,SUM(AY121:AY1110),\"\"),\"\")","v":""},{"$f":"IFERROR(IF(SUM(AZ121:AZ1110)<>0,SUM(AZ121:AZ1110),\"\"),\"\")","v":""},{"$f":"IFERROR(IF(SUM(BA121:BA1110)<>0,SUM(BA121:BA1110),\"\"),\"\")","v":""},{"$f":"IFERROR(IF(SUM(BB121:BB1110)<>0,SUM(BB121:BB1110),\"\"),\"\")","v":""},{"$f":"IFERROR(IF(SUM(BC121:BC1110)<>0,SUM(BC121:BC1110),\"\"),\"\")","v":""},{"$f":"SUM(BD117:BI146)","v":0},{"$f":"IFERROR(IF(SUM(BE121:BE1110)<>0,SUM(BE121:BE1110),\"\"),\"\")","v":""},{"$f":"IFERROR(IF(SUM(BF121:BF1110)<>0,SUM(BF121:BF1110),\"\"),\"\")","v":""},{"$f":"IFERROR(IF(SUM(BG121:BG1110)<>0,SUM(BG121:BG1110),\"\"),\"\")","v":""},{"$f":"IFERROR(IF(SUM(BH121:BH1110)<>0,SUM(BH121:BH1110),\"\"),\"\")","v":""},{"$f":"IFERROR(IF(SUM(BI121:BI1110)<>0,SUM(BI121:BI1110),\"\"),\"\")","v":""},{"$f":"SUM(BJ117:BO146)","v":0},{"$f":"IFERROR(IF(SUM(BK121:BK1110)<>0,SUM(BK121:BK1110),\"\"),\"\")","v":""},{"$f":"IFERROR(IF(SUM(BL121:BL1110)<>0,SUM(BL121:BL1110),\"\"),\"\")","v":""},{"$f":"IFERROR(IF(SUM(BM121:BM1110)<>0,SUM(BM121:BM1110),\"\"),\"\")","v":""},{"$f":"IFERROR(IF(SUM(BN121:BN1110)<>0,SUM(BN121:BN1110),\"\"),\"\")","v":""},{"$f":"IFERROR(IF(SUM(BO121:BO1110)<>0,SUM(BO121:BO1110),\"\"),\"\")","v":""},{"$f":"SUM(BP117:BU146)","v":0},{"$f":"IFERROR(IF(SUM(BQ121:BQ1110)<>0,SUM(BQ121:BQ1110),\"\"),\"\")","v":""},{"$f":"IFERROR(IF(SUM(BR121:BR1110)<>0,SUM(BR121:BR1110),\"\"),\"\")","v":""},{"$f":"IFERROR(IF(SUM(BS121:BS1110)<>0,SUM(BS121:BS1110),\"\"),\"\")","v":""},{"$f":"IFERROR(IF(SUM(BT121:BT1110)<>0,SUM(BT121:BT1110),\"\"),\"\")","v":""},{"$f":"IFERROR(IF(SUM(BU121:BU1110)<>0,SUM(BU121:BU1110),\"\"),\"\")","v":""}]
[null,0,null,0,null,null,null,null,null,null,null,null,null,null,null,null,0,null,null,null,null,null,0,null,null,null,null,null,0,null,null,null,null,null,0,null,null,null,null,null,null,0,null,0,null,null,null,null,null,0,null,null,null,null,null,0,null,null,null,null,null,0,null,null,null,null,null,0]
[null,1,null,null,null,null,null,null,null,null,null,{"$f":"(ROUND(J117/$BI$6,5))","v":{"$error":"#DIV/0!"}},{"$f":"(ROUND($BD$5*L117,5))","v":{"$error":"#DIV/0!"}},{"$f":"ROUND(K117/$BI$7,5)","v":{"$error":"#DIV/0!"}},{"$f":"ROUND($BJ$5*N117,5)","v":{"$error":"#DIV/0!"}},{"$f":"IF(AND(J117<>\"\",K117<>\"\"),ROUND(M117+O117+$BO$5,5),0)","v":0},{"$f":"IF(P117=0,0,(D117*P117)-D117)","v":0},null,null,null,null,null,{"$f":"D117+Q117","v":0},null,null,null,null,null,{"$f":"IF('2.Vorderingsstaat'!$AC$6=TRUE,\"BTW verlegd\",W117*$BA$19)","v":"BTW verlegd"},null,null,null,null,null,{"$f":"IF('2.Vorderingsstaat'!$AC$6=TRUE,\"BTW verlegd\",AC117+W117)","v":"BTW verlegd"},null,null,null,null,null,null,1,null,null,null,null,null,null,null,null,null,null,null,null,null,{"$f":"AR117+AX117","v":0},null,null,null,null,null,{"$f":"IF('2.Vorderingsstaat'!$AC$6=TRUE,\"BTW verlegd\",BD117*$BA$19)","v":"BTW verlegd"},null,null,null,null,null,{"$f":"IF('2.Vorderingsstaat'!$AC$6=TRUE,\"BTW verlegd\",BJ117+BD117)","v":"BTW verlegd"},null,null,null,null,null,{"$f":"IFERROR((D117+AR117)/$AC$33,0)","v":0}]
[null,2,null,null,null,null,null,null,null,null,null,{"$f":"(ROUND(J118/$BI$6,5))","v":{"$error":"#DIV/0!"}},{"$f":"(ROUND($BD$5*L118,5))","v":{"$error":"#DIV/0!"}},{"$f":"ROUND(K118/$BI$7,5)","v":{"$error":"#DIV/0!"}},{"$f":"ROUND($BJ$5*N118,5)","v":{"$error":"#DIV/0!"}},{"$f":"IF(AND(J118<>\"\",K118<>\"\"),ROUND(M118+O118+$BO$5,5),0)","v":0},{"$f":"IF(P118=0,0,(D118*P118)-D118)","v":0},null,null,null,null,null,{"$f":"D118+Q118","v":0},null,null,null,null,null,{"$f":"IF('2.Vorderingsstaat'!$AC$6=TRUE,\"BTW verlegd\",W118*$BA$19)","v":"BTW verlegd"},null,null,null,null,null,{"$f":"IF('2.Vorderingsstaat'!$AC$6=TRUE,\"BTW verlegd\",AC118+W118)","v":"BTW verlegd"},null,null,null,null,null,null,2,null,null,null,null,null,null,null,null,null,null,null,null,null,{"$f":"AR118+AX118","v":0},null,null,null,null,null,{"$f":"IF('2.Vorderingsstaat'!$AC$6=TRUE,\"BTW verlegd\",BD118*$BA$19)","v":"BTW verlegd"},null,null,null,null,null,{"$f":"IF('2.Vorderingsstaat'!$AC$6=TRUE,\"BTW verlegd\",BJ118+BD118)","v":"BTW verlegd"},null,null,null,null,null,{"$f":"IF(D118=\"\",0,IFERROR((SUM($AR$117:AW118,$D$117:I118)/$AC$33),0))","v":0}]
[null,3,null,null,null,null,null,null,null,null,null,{"$error":"#DIV/0!"},{"$error":"#DIV/0!"},{"$error":"#DIV/0!"},{"$error":"#DIV/0!"},0,0,null,null,null,null,null,0,null,null,null,null,null,{"$f":"IF('2.Vorderingsstaat'!$AC$6=TRUE,\"BTW verlegd\",W119*$BA$19)","v":"BTW verlegd"},null,null,null,null,null,{"$f":"IF('2.Vorderingsstaat'!$AC$6=TRUE,\"BTW verlegd\",AC119+W119)","v":"BTW verlegd"},null,null,null,null,null,null,3,null,null,null,null,null,null,null,null,null,null,null,null,null,0,null,null,null,null,null,{"$f":"IF('2.Vorderingsstaat'!$AC$6=TRUE,\"BTW verlegd\",BD119*$BA$19)","v":"BTW verlegd"},null,null,null,null,null,{"$f":"IF('2.Vorderingsstaat'!$AC$6=TRUE,\"BTW verlegd\",BJ119+BD119)","v":"BTW verlegd"},null,null,null,null,null,{"$f":"IF(D119=\"\",0,IFERROR((SUM($AR$117:AW119,$D$117:I119)/$AC$33),0))","v":0}]
[null,4,null,null,null,null,null,null,null,null,null,{"$error":"#DIV/0!"},{"$error":"#DIV/0!"},{"$error":"#DIV/0!"},{"$error":"#DIV/0!"},0,0,null,null,null,null,null,0,null,null,null,null,null,{"$f":"IF('2.Vorderingsstaat'!$AC$6=TRUE,\"BTW verlegd\",W120*$BA$19)","v":"BTW verlegd"},null,null,null,null,null,{"$f":"IF('2.Vorderingsstaat'!$AC$6=TRUE,\"BTW verlegd\",AC120+W120)","v":"BTW verlegd"},null,null,null,null,null,null,4,null,null,null,null,null,null,null,null,null,null,null,null,null,0,null,null,null,null,null,{"$f":"IF('2.Vorderingsstaat'!$AC$6=TRUE,\"BTW verlegd\",BD120*$BA$19)","v":"BTW verlegd"},null,null,null,null,null,{"$f":"IF('2.Vorderingsstaat'!$AC$6=TRUE,\"BTW verlegd\",BJ120+BD120)","v":"BTW verlegd"},null,null,null,null,null,{"$f":"IF(D120=\"\",0,IFERROR((SUM($AR$117:AW120,$D$117:I120)/$AC$33),0))","v":0}]
[null,5,null,null,null,null,null,null,null,null,null,{"$error":"#DIV/0!"},{"$error":"#DIV/0!"},{"$error":"#DIV/0!"},{"$error":"#DIV/0!"},0,0,null,null,null,null,null,0,null,null,null,null,null,{"$f":"IF('2.Vorderingsstaat'!$AC$6=TRUE,\"BTW verlegd\",W121*$BA$19)","v":"BTW verlegd"},null,null,null,null,null,{"$f":"IF('2.Vorderingsstaat'!$AC$6=TRUE,\"BTW verlegd\",AC121+W121)","v":"BTW verlegd"},null,null,null,null,null,null,5,null,null,null,null,null,null,null,null,null,null,null,null,null,0,null,null,null,null,null,{"$f":"IF('2.Vorderingsstaat'!$AC$6=TRUE,\"BTW verlegd\",BD121*$BA$19)","v":"BTW verlegd"},null,null,null,null,null,{"$f":"IF('2.Vorderingsstaat'!$AC$6=TRUE,\"BTW verlegd\",BJ121+BD121)","v":"BTW verlegd"},null,null,null,null,null,{"$f":"IF(D121=\"\",0,IFERROR((SUM($AR$117:AW121,$D$117:I121)/$AC$33),0))","v":0}]
[null,6,null,null,null,null,null,null,null,null,null,{"$error":"#DIV/0!"},{"$error":"#DIV/0!"},{"$error":"#DIV/0!"},{"$error":"#DIV/0!"},0,0,null,null,null,null,null,0,null,null,null,null,null,{"$f":"IF('2.Vorderingsstaat'!$AC$6=TRUE,\"BTW verlegd\",W122*$BA$19)","v":"BTW verlegd"},null,null,null,null,null,{"$f":"IF('2.Vorderingsstaat'!$AC$6=TRUE,\"BTW verlegd\",AC122+W122)","v":"BTW verlegd"},null,null,null,null,null,null,6,null,null,null,null,null,null,null,null,null,null,null,null,null,0,null,null,null,null,null,{"$f":"IF('2.Vorderingsstaat'!$AC$6=TRUE,\"BTW verlegd\",BD122*$BA$19)","v":"BTW verlegd"},null,null,null,null,null,{"$f":"IF('2.Vorderingsstaat'!$AC$6=TRUE,\"BTW verlegd\",BJ122+BD122)","v":"BTW verlegd"},null,null,null,null,null,{"$f":"IF(D122=\"\",0,IFERROR((SUM($AR$117:AW122,$D$117:I122)/$AC$33),0))","v":0}]
[null,7,null,null,null,null,null,null,null,null,null,{"$error":"#DIV/0!"},{"$error":"#DIV/0!"},{"$error":"#DIV/0!"},{"$error":"#DIV/0!"},0,0,null,null,null,null,null,0,null,null,null,null,null,{"$f":"IF('2.Vorderingsstaat'!$AC$6=TRUE,\"BTW verlegd\",W123*$BA$19)","v":"BTW verlegd"},null,null,null,null,null,{"$f":"IF('2.Vorderingsstaat'!$AC$6=TRUE,\"BTW verlegd\",AC123+W123)","v":"BTW verlegd"},null,null,null,null,null,null,7,null,null,null,null,null,null,null,null,null,null,null,null,null,0,null,null,null,null,null,{"$f":"IF('2.Vorderingsstaat'!$AC$6=TRUE,\"BTW verlegd\",BD123*$BA$19)","v":"BTW verlegd"},null,null,null,null,null,{"$f":"IF('2.Vorderingsstaat'!$AC$6=TRUE,\"BTW verlegd\",BJ123+BD123)","v":"BTW verlegd"},null,null,null,null,null,{"$f":"IF(D123=\"\",0,IFERROR((SUM($AR$117:AW123,$D$117:I123)/$AC$33),0))","v":0}]
[null,8,null,null,null,null,null,null,null,null,null,{"$error":"#DIV/0!"},{"$error":"#DIV/0!"},{"$error":"#DIV/0!"},{"$error":"#DIV/0!"},0,0,null,null,null,null,null,0,null,null,null,null,null,{"$f":"IF('2.Vorderingsstaat'!$AC$6=TRUE,\"BTW verlegd\",W124*$BA$19)","v":"BTW verlegd"},null,null,null,null,null,{"$f":"IF('2.Vorderingsstaat'!$AC$6=TRUE,\"BTW verlegd\",AC124+W124)","v":"BTW verlegd"},null,null,null,null,null,null,8,null,null,null,null,null,null,null,null,null,null,null,null,null,0,null,null,null,null,null,{"$f":"IF('2.Vorderingsstaat'!$AC$6=TRUE,\"BTW verlegd\",BD124*$BA$19)","v":"BTW verlegd"},null,null,null,null,null,{"$f":"IF('2.Vorderingsstaat'!$AC$6=TRUE,\"BTW verlegd\",BJ124+BD124)","v":"BTW verlegd"},null,null,null,null,null,{"$f":"IF(D124=\"\",0,IFERROR((SUM($AR$117:AW124,$D$117:I124)/$AC$33),0))","v":0}]
[null,9,null,null,null,null,null,null,null,null,null,{"$error":"#DIV/0!"},{"$error":"#DIV/0!"},{"$error":"#DIV/0!"},{"$error":"#DIV/0!"},0,0,null,null,null,null,null,0,null,null,null,null,null,{"$f":"IF('2.Vorderingsstaat'!$AC$6=TRUE,\"BTW verlegd\",W125*$BA$19)","v":"BTW verlegd"},null,null,null,null,null,{"$f":"IF('2.Vorderingsstaat'!$AC$6=TRUE,\"BTW verlegd\",AC125+W125)","v":"BTW verlegd"},null,null,null,null,null,null,9,null,null,null,null,null,null,null,null,null,null,null,null,null,0,null,null,null,null,null,{"$f":"IF('2.Vorderingsstaat'!$AC$6=TRUE,\"BTW verlegd\",BD125*$BA$19)","v":"BTW verlegd"},null,null,null,null,null,{"$f":"IF('2.Vorderingsstaat'!$AC$6=TRUE,\"BTW verlegd\",BJ125+BD125)","v":"BTW verlegd"},null,null,null,null,null,{"$f":"IF(D125=\"\",0,IFERROR((SUM($AR$117:AW125,$D$117:I125)/$AC$33),0))","v":0}]
[null,10,null,null,null,null,null,null,null,null,null,{"$error":"#DIV/0!"},{"$error":"#DIV/0!"},{"$error":"#DIV/0!"},{"$error":"#DIV/0!"},0,0,null,null,null,null,null,0,null,null,null,null,null,{"$f":"IF('2.Vorderingsstaat'!$AC$6=TRUE,\"BTW verlegd\",W126*$BA$19)","v":"BTW verlegd"},null,null,null,null,null,{"$f":"IF('2.Vorderingsstaat'!$AC$6=TRUE,\"BTW verlegd\",AC126+W126)","v":"BTW verlegd"},null,null,null,null,null,null,10,null,null,null,null,null,null,null,null,null,null,null,null,null,0,null,null,null,null,null,{"$f":"IF('2.Vorderingsstaat'!$AC$6=TRUE,\"BTW verlegd\",BD126*$BA$19)","v":"BTW verlegd"},null,null,null,null,null,{"$f":"IF('2.Vorderingsstaat'!$AC$6=TRUE,\"BTW verlegd\",BJ126+BD126)","v":"BTW verlegd"},null,null,null,null,null,{"$f":"IF(D126=\"\",0,IFERROR((SUM($AR$117:AW126,$D$117:I126)/$AC$33),0))","v":0}]
[null,11,null,null,null,null,null,null,null,null,null,{"$error":"#DIV/0!"},{"$error":"#DIV/0!"},{"$error":"#DIV/0!"},{"$error":"#DIV/0!"},0,0,null,null,null,null,null,0,null,null,null,null,null,{"$f":"IF('2.Vorderingsstaat'!$AC$6=TRUE,\"BTW verlegd\",W127*$BA$19)","v":"BTW verlegd"},null,null,null,null,null,{"$f":"IF('2.Vorderingsstaat'!$AC$6=TRUE,\"BTW verlegd\",AC127+W127)","v":"BTW verlegd"},null,null,null,null,null,null,11,null,null,null,null,null,null,null,null,null,null,null,null,null,0,null,null,null,null,null,{"$f":"IF('2.Vorderingsstaat'!$AC$6=TRUE,\"BTW verlegd\",BD127*$BA$19)","v":"BTW verlegd"},null,null,null,null,null,{"$f":"IF('2.Vorderingsstaat'!$AC$6=TRUE,\"BTW verlegd\",BJ127+BD127)","v":"BTW verlegd"},null,null,null,null,null,{"$f":"IF(D127=\"\",0,IFERROR((SUM($AR$117:AW127,$D$117:I127)/$AC$33),0))","v":0}]
[null,12,null,null,null,null,null,null,null,null,null,{"$error":"#DIV/0!"},{"$error":"#DIV/0!"},{"$error":"#DIV/0!"},{"$error":"#DIV/0!"},0,0,null,null,null,null,null,0,null,null,null,null,null,{"$f":"IF('2.Vorderingsstaat'!$AC$6=TRUE,\"BTW verlegd\",W128*$BA$19)","v":"BTW verlegd"},null,null,null,null,null,{"$f":"IF('2.Vorderingsstaat'!$AC$6=TRUE,\"BTW verlegd\",AC128+W128)","v":"BTW verlegd"},null,null,null,null,null,null,12,null,null,null,null,null,null,null,null,null,null,null,null,null,0,null,null,null,null,null,{"$f":"IF('2.Vorderingsstaat'!$AC$6=TRUE,\"BTW verlegd\",BD128*$BA$19)","v":"BTW verlegd"},null,null,null,null,null,{"$f":"IF('2.Vorderingsstaat'!$AC$6=TRUE,\"BTW verlegd\",BJ128+BD128)","v":"BTW verlegd"},null,null,null,null,null,{"$f":"IF(D128=\"\",0,IFERROR((SUM($AR$117:AW128,$D$117:I128)/$AC$33),0))","v":0}]
[null,13,null,null,null,null,null,null,null,null,null,{"$error":"#DIV/0!"},{"$error":"#DIV/0!"},{"$error":"#DIV/0!"},{"$error":"#DIV/0!"},0,0,null,null,null,null,null,0,null,null,null,null,null,{"$f":"IF('2.Vorderingsstaat'!$AC$6=TRUE,\"BTW verlegd\",W129*$BA$19)","v":"BTW verlegd"},null,null,null,null,null,{"$f":"IF('2.Vorderingsstaat'!$AC$6=TRUE,\"BTW verlegd\",AC129+W129)","v":"BTW verlegd"},null,null,null,null,null,null,13,null,null,null,null,null,null,null,null,null,null,null,null,null,0,null,null,null,null,null,{"$f":"IF('2.Vorderingsstaat'!$AC$6=TRUE,\"BTW verlegd\",BD129*$BA$19)","v":"BTW verlegd"},null,null,null,null,null,{"$f":"IF('2.Vorderingsstaat'!$AC$6=TRUE,\"BTW verlegd\",BJ129+BD129)","v":"BTW verlegd"},null,null,null,null,null,{"$f":"IF(D129=\"\",0,IFERROR((SUM($AR$117:AW129,$D$117:I129)/$AC$33),0))","v":0}]
[null,14,null,null,null,null,null,null,null,null,null,{"$error":"#DIV/0!"},{"$error":"#DIV/0!"},{"$error":"#DIV/0!"},{"$error":"#DIV/0!"},0,0,null,null,null,null,null,0,null,null,null,null,null,{"$f":"IF('2.Vorderingsstaat'!$AC$6=TRUE,\"BTW verlegd\",W130*$BA$19)","v":"BTW verlegd"},null,null,null,null,null,{"$f":"IF('2.Vorderingsstaat'!$AC$6=TRUE,\"BTW verlegd\",AC130+W130)","v":"BTW verlegd"},null,null,null,null,null,null,14,null,null,null,null,null,null,null,null,null,null,null,null,null,0,null,null,null,null,null,{"$f":"IF('2.Vorderingsstaat'!$AC$6=TRUE,\"BTW verlegd\",BD130*$BA$19)","v":"BTW verlegd"},null,null,null,null,null,{"$f":"IF('2.Vorderingsstaat'!$AC$6=TRUE,\"BTW verlegd\",BJ130+BD130)","v":"BTW verlegd"},null,null,null,null,null,{"$f":"IF(D130=\"\",0,IFERROR((SUM($AR$117:AW130,$D$117:I130)/$AC$33),0))","v":0}]
[null,15,null,null,null,null,null,null,null,null,null,{"$error":"#DIV/0!"},{"$error":"#DIV/0!"},{"$error":"#DIV/0!"},{"$error":"#DIV/0!"},0,0,null,null,null,null,null,0,null,null,null,null,null,{"$f":"IF('2.Vorderingsstaat'!$AC$6=TRUE,\"BTW verlegd\",W131*$BA$19)","v":"BTW verlegd"},null,null,null,null,null,{"$f":"IF('2.Vorderingsstaat'!$AC$6=TRUE,\"BTW verlegd\",AC131+W131)","v":"BTW verlegd"},null,null,null,null,null,null,15,null,null,null,null,null,null,null,null,null,null,null,null,null,0,null,null,null,null,null,{"$f":"IF('2.Vorderingsstaat'!$AC$6=TRUE,\"BTW verlegd\",BD131*$BA$19)","v":"BTW verlegd"},null,null,null,null,null,{"$f":"IF('2.Vorderingsstaat'!$AC$6=TRUE,\"BTW verlegd\",BJ131+BD131)","v":"BTW verlegd"},null,null,null,null,null,{"$f":"IF(D131=\"\",0,IFERROR((SUM($AR$117:AW131,$D$117:I131)/$AC$33),0))","v":0}]
[null,16,null,null,null,null,null,null,null,null,null,{"$error":"#DIV/0!"},{"$error":"#DIV/0!"},{"$error":"#DIV/0!"},{"$error":"#DIV/0!"},0,0,null,null,null,null,null,0,null,null,null,null,null,{"$f":"IF('2.Vorderingsstaat'!$AC$6=TRUE,\"BTW verlegd\",W132*$BA$19)","v":"BTW verlegd"},null,null,null,null,null,{"$f":"IF('2.Vorderingsstaat'!$AC$6=TRUE,\"BTW verlegd\",AC132+W132)","v":"BTW verlegd"},null,null,null,null,null,null,16,null,null,null,null,null,null,null,null,null,null,null,null,null,0,null,null,null,null,null,{"$f":"IF('2.Vorderingsstaat'!$AC$6=TRUE,\"BTW verlegd\",BD132*$BA$19)","v":"BTW verlegd"},null,null,null,null,null,{"$f":"IF('2.Vorderingsstaat'!$AC$6=TRUE,\"BTW verlegd\",BJ132+BD132)","v":"BTW verlegd"},null,null,null,null,null,{"$f":"IF(D132=\"\",0,IFERROR((SUM($AR$117:AW132,$D$117:I132)/$AC$33),0))","v":0}]
[null,17,null,null,null,null,null,null,null,null,null,{"$error":"#DIV/0!"},{"$error":"#DIV/0!"},{"$error":"#DIV/0!"},{"$error":"#DIV/0!"},0,0,null,null,null,null,null,0,null,null,null,null,null,{"$f":"IF('2.Vorderingsstaat'!$AC$6=TRUE,\"BTW verlegd\",W133*$BA$19)","v":"BTW verlegd"},null,null,null,null,null,{"$f":"IF('2.Vorderingsstaat'!$AC$6=TRUE,\"BTW verlegd\",AC133+W133)","v":"BTW verlegd"},null,null,null,null,null,null,17,null,null,null,null,null,null,null,null,null,null,null,null,null,0,null,null,null,null,null,{"$f":"IF('2.Vorderingsstaat'!$AC$6=TRUE,\"BTW verlegd\",BD133*$BA$19)","v":"BTW verlegd"},null,null,null,null,null,{"$f":"IF('2.Vorderingsstaat'!$AC$6=TRUE,\"BTW verlegd\",BJ133+BD133)","v":"BTW verlegd"},null,null,null,null,null,{"$f":"IF(D133=\"\",0,IFERROR((SUM($AR$117:AW133,$D$117:I133)/$AC$33),0))","v":0}]
[null,18,null,null,null,null,null,null,null,null,null,{"$error":"#DIV/0!"},{"$error":"#DIV/0!"},{"$error":"#DIV/0!"},{"$error":"#DIV/0!"},0,0,null,null,null,null,null,0,null,null,null,null,null,{"$f":"IF('2.Vorderingsstaat'!$AC$6=TRUE,\"BTW verlegd\",W134*$BA$19)","v":"BTW verlegd"},null,null,null,null,null,{"$f":"IF('2.Vorderingsstaat'!$AC$6=TRUE,\"BTW verlegd\",AC134+W134)","v":"BTW verlegd"},null,null,null,null,null,null,18,null,null,null,null,null,null,null,null,null,null,null,null,null,0,null,null,null,null,null,{"$f":"IF('2.Vorderingsstaat'!$AC$6=TRUE,\"BTW verlegd\",BD134*$BA$19)","v":"BTW verlegd"},null,null,null,null,null,{"$f":"IF('2.Vorderingsstaat'!$AC$6=TRUE,\"BTW verlegd\",BJ134+BD134)","v":"BTW verlegd"},null,null,null,null,null,{"$f":"IF(D134=\"\",0,IFERROR((SUM($AR$117:AW134,$D$117:I134)/$AC$33),0))","v":0}]
[null,19,null,null,null,null,null,null,null,null,null,{"$error":"#DIV/0!"},{"$error":"#DIV/0!"},{"$error":"#DIV/0!"},{"$error":"#DIV/0!"},0,0,null,null,null,null,null,0,null,null,null,null,null,{"$f":"IF('2.Vorderingsstaat'!$AC$6=TRUE,\"BTW verlegd\",W135*$BA$19)","v":"BTW verlegd"},null,null,null,null,null,{"$f":"IF('2.Vorderingsstaat'!$AC$6=TRUE,\"BTW verlegd\",AC135+W135)","v":"BTW verlegd"},null,null,null,null,null,null,19,null,null,null,null,null,null,null,null,null,null,null,null,null,0,null,null,null,null,null,{"$f":"IF('2.Vorderingsstaat'!$AC$6=TRUE,\"BTW verlegd\",BD135*$BA$19)","v":"BTW verlegd"},null,null,null,null,null,{"$f":"IF('2.Vorderingsstaat'!$AC$6=TRUE,\"BTW verlegd\",BJ135+BD135)","v":"BTW verlegd"},null,null,null,null,null,{"$f":"IF(D135=\"\",0,IFERROR((SUM($AR$117:AW135,$D$117:I135)/$AC$33),0))","v":0}]
[null,20,null,null,null,null,null,null,null,null,null,{"$error":"#DIV/0!"},{"$error":"#DIV/0!"},{"$error":"#DIV/0!"},{"$error":"#DIV/0!"},0,0,null,null,null,null,null,0,null,null,null,null,null,{"$f":"IF('2.Vorderingsstaat'!$AC$6=TRUE,\"BTW verlegd\",W136*$BA$19)","v":"BTW verlegd"},null,null,null,null,null,{"$f":"IF('2.Vorderingsstaat'!$AC$6=TRUE,\"BTW verlegd\",AC136+W136)","v":"BTW verlegd"},null,null,null,null,null,null,20,null,null,null,null,null,null,null,null,null,null,null,null,null,0,null,null,null,null,null,{"$f":"IF('2.Vorderingsstaat'!$AC$6=TRUE,\"BTW verlegd\",BD136*$BA$19)","v":"BTW verlegd"},null,null,null,null,null,{"$f":"IF('2.Vorderingsstaat'!$AC$6=TRUE,\"BTW verlegd\",BJ136+BD136)","v":"BTW verlegd"},null,null,null,null,null,{"$f":"IF(D136=\"\",0,IFERROR((SUM($AR$117:AW136,$D$117:I136)/$AC$33),0))","v":0}]
[null,21,null,null,null,null,null,null,null,null,null,{"$f":"(ROUND(J137/$BI$6,5))","v":{"$error":"#DIV/0!"}},{"$f":"(ROUND($BD$5*L137,5))","v":{"$error":"#DIV/0!"}},{"$f":"ROUND(K137/$BI$7,5)","v":{"$error":"#DIV/0!"}},{"$f":"ROUND($BJ$5*N137,5)","v":{"$error":"#DIV/0!"}},{"$f":"IF(AND(J137<>\"\",K137<>\"\"),ROUND(M137+O137+$BO$5,5),0)","v":0},{"$f":"IF(P137=0,0,(D137*P137)-D137)","v":0},null,null,null,null,null,{"$f":"D137+Q137","v":0},null,null,null,null,null,{"$f":"IF('2.Vorderingsstaat'!$AC$6=TRUE,\"BTW verlegd\",W137*$BA$19)","v":"BTW verlegd"},null,null,null,null,null,{"$f":"IF('2.Vorderingsstaat'!$AC$6=TRUE,\"BTW verlegd\",AC137+W137)","v":"BTW verlegd"},null,null,null,null,null,null,21,null,null,null,null,null,null,null,null,null,null,null,null,null,{"$f":"AR137+AX137","v":0},null,null,null,null,null,{"$f":"IF('2.Vorderingsstaat'!$AC$6=TRUE,\"BTW verlegd\",BD137*$BA$19)","v":"BTW verlegd"},null,null,null,null,null,{"$f":"IF('2.Vorderingsstaat'!$AC$6=TRUE,\"BTW verlegd\",BJ137+BD137)","v":"BTW verlegd"},null,null,null,null,null,{"$f":"IF(D137=\"\",0,IFERROR((SUM($AR$117:AW137,$D$117:I137)/$AC$33),0))","v":0}]
[null,22,null,null,null,null,null,null,null,null,null,{"$error":"#DIV/0!"},{"$error":"#DIV/0!"},{"$error":"#DIV/0!"},{"$error":"#DIV/0!"},0,0,null,null,null,null,null,0,null,null,null,null,null,{"$f":"IF('2.Vorderingsstaat'!$AC$6=TRUE,\"BTW verlegd\",W138*$BA$19)","v":"BTW verlegd"},null,null,null,null,null,{"$f":"IF('2.Vorderingsstaat'!$AC$6=TRUE,\"BTW verlegd\",AC138+W138)","v":"BTW verlegd"},null,null,null,null,null,null,22,null,null,null,null,null,null,null,null,null,null,null,null,null,0,null,null,null,null,null,{"$f":"IF('2.Vorderingsstaat'!$AC$6=TRUE,\"BTW verlegd\",BD138*$BA$19)","v":"BTW verlegd"},null,null,null,null,null,{"$f":"IF('2.Vorderingsstaat'!$AC$6=TRUE,\"BTW verlegd\",BJ138+BD138)","v":"BTW verlegd"},null,null,null,null,null,{"$f":"IF(D138=\"\",0,IFERROR((SUM($AR$117:AW138,$D$117:I138)/$AC$33),0))","v":0}]
[null,23,null,null,null,null,null,null,null,null,null,{"$error":"#DIV/0!"},{"$error":"#DIV/0!"},{"$error":"#DIV/0!"},{"$error":"#DIV/0!"},0,0,null,null,null,null,null,0,null,null,null,null,null,{"$f":"IF('2.Vorderingsstaat'!$AC$6=TRUE,\"BTW verlegd\",W139*$BA$19)","v":"BTW verlegd"},null,null,null,null,null,{"$f":"IF('2.Vorderingsstaat'!$AC$6=TRUE,\"BTW verlegd\",AC139+W139)","v":"BTW verlegd"},null,null,null,null,null,null,23,null,null,null,null,null,null,null,null,null,null,null,null,null,0,null,null,null,null,null,{"$f":"IF('2.Vorderingsstaat'!$AC$6=TRUE,\"BTW verlegd\",BD139*$BA$19)","v":"BTW verlegd"},null,null,null,null,null,{"$f":"IF('2.Vorderingsstaat'!$AC$6=TRUE,\"BTW verlegd\",BJ139+BD139)","v":"BTW verlegd"},null,null,null,null,null,{"$f":"IF(D139=\"\",0,IFERROR((SUM($AR$117:AW139,$D$117:I139)/$AC$33),0))","v":0}]
[null,24,null,null,null,null,null,null,null,null,null,{"$error":"#DIV/0!"},{"$error":"#DIV/0!"},{"$error":"#DIV/0!"},{"$error":"#DIV/0!"},0,0,null,null,null,null,null,0,null,null,null,null,null,{"$f":"IF('2.Vorderingsstaat'!$AC$6=TRUE,\"BTW verlegd\",W140*$BA$19)","v":"BTW verlegd"},null,null,null,null,null,{"$f":"IF('2.Vorderingsstaat'!$AC$6=TRUE,\"BTW verlegd\",AC140+W140)","v":"BTW verlegd"},null,null,null,null,null,null,24,null,null,null,null,null,null,null,null,null,null,null,null,null,0,null,null,null,null,null,{"$f":"IF('2.Vorderingsstaat'!$AC$6=TRUE,\"BTW verlegd\",BD140*$BA$19)","v":"BTW verlegd"},null,null,null,null,null,{"$f":"IF('2.Vorderingsstaat'!$AC$6=TRUE,\"BTW verlegd\",BJ140+BD140)","v":"BTW verlegd"},null,null,null,null,null,{"$f":"IF(D140=\"\",0,IFERROR((SUM($AR$117:AW140,$D$117:I140)/$AC$33),0))","v":0}]
[null,25,null,null,null,null,null,null,null,null,null,{"$error":"#DIV/0!"},{"$error":"#DIV/0!"},{"$error":"#DIV/0!"},{"$error":"#DIV/0!"},0,0,null,null,null,null,null,0,null,null,null,null,null,{"$f":"IF('2.Vorderingsstaat'!$AC$6=TRUE,\"BTW verlegd\",W141*$BA$19)","v":"BTW verlegd"},null,null,null,null,null,{"$f":"IF('2.Vorderingsstaat'!$AC$6=TRUE,\"BTW verlegd\",AC141+W141)","v":"BTW verlegd"},null,null,null,null,null,null,25,null,null,null,null,null,null,null,null,null,null,null,null,null,0,null,null,null,null,null,{"$f":"IF('2.Vorderingsstaat'!$AC$6=TRUE,\"BTW verlegd\",BD141*$BA$19)","v":"BTW verlegd"},null,null,null,null,null,{"$f":"IF('2.Vorderingsstaat'!$AC$6=TRUE,\"BTW verlegd\",BJ141+BD141)","v":"BTW verlegd"},null,null,null,null,null,{"$f":"IF(D141=\"\",0,IFERROR((SUM($AR$117:AW141,$D$117:I141)/$AC$33),0))","v":0}]
[null,26,null,null,null,null,null,null,null,null,null,{"$error":"#DIV/0!"},{"$error":"#DIV/0!"},{"$error":"#DIV/0!"},{"$error":"#DIV/0!"},0,0,null,null,null,null,null,0,null,null,null,null,null,{"$f":"IF('2.Vorderingsstaat'!$AC$6=TRUE,\"BTW verlegd\",W142*$BA$19)","v":"BTW verlegd"},null,null,null,null,null,{"$f":"IF('2.Vorderingsstaat'!$AC$6=TRUE,\"BTW verlegd\",AC142+W142)","v":"BTW verlegd"},null,null,null,null,null,null,26,null,null,null,null,null,null,null,null,null,null,null,null,null,0,null,null,null,null,null,{"$f":"IF('2.Vorderingsstaat'!$AC$6=TRUE,\"BTW verlegd\",BD142*$BA$19)","v":"BTW verlegd"},null,null,null,null,null,{"$f":"IF('2.Vorderingsstaat'!$AC$6=TRUE,\"BTW verlegd\",BJ142+BD142)","v":"BTW verlegd"},null,null,null,null,null,{"$f":"IF(D142=\"\",0,IFERROR((SUM($AR$117:AW142,$D$117:I142)/$AC$33),0))","v":0}]
[null,27,null,null,null,null,null,null,null,null,null,{"$error":"#DIV/0!"},{"$error":"#DIV/0!"},{"$error":"#DIV/0!"},{"$error":"#DIV/0!"},0,0,null,null,null,null,null,0,null,null,null,null,null,{"$f":"IF('2.Vorderingsstaat'!$AC$6=TRUE,\"BTW verlegd\",W143*$BA$19)","v":"BTW verlegd"},null,null,null,null,null,{"$f":"IF('2.Vorderingsstaat'!$AC$6=TRUE,\"BTW verlegd\",AC143+W143)","v":"BTW verlegd"},null,null,null,null,null,null,27,null,null,null,null,null,null,null,null,null,null,null,null,null,0,null,null,null,null,null,{"$f":"IF('2.Vorderingsstaat'!$AC$6=TRUE,\"BTW verlegd\",BD143*$BA$19)","v":"BTW verlegd"},null,null,null,null,null,{"$f":"IF('2.Vorderingsstaat'!$AC$6=TRUE,\"BTW verlegd\",BJ143+BD143)","v":"BTW verlegd"},null,null,null,null,null,{"$f":"IF(D143=\"\",0,IFERROR((SUM($AR$117:AW143,$D$117:I143)/$AC$33),0))","v":0}]
[null,28,null,null,null,null,null,null,null,null,null,{"$error":"#DIV/0!"},{"$error":"#DIV/0!"},{"$error":"#DIV/0!"},{"$error":"#DIV/0!"},0,0,null,null,null,null,null,0,null,null,null,null,null,{"$f":"IF('2.Vorderingsstaat'!$AC$6=TRUE,\"BTW verlegd\",W144*$BA$19)","v":"BTW verlegd"},null,null,null,null,null,{"$f":"IF('2.Vorderingsstaat'!$AC$6=TRUE,\"BTW verlegd\",AC144+W144)","v":"BTW verlegd"},null,null,null,null,null,null,28,null,null,null,null,null,null,null,null,null,null,null,null,null,0,null,null,null,null,null,{"$f":"IF('2.Vorderingsstaat'!$AC$6=TRUE,\"BTW verlegd\",BD144*$BA$19)","v":"BTW verlegd"},null,null,null,null,null,{"$f":"IF('2.Vorderingsstaat'!$AC$6=TRUE,\"BTW verlegd\",BJ144+BD144)","v":"BTW verlegd"},null,null,null,null,null,{"$f":"IF(D144=\"\",0,IFERROR((SUM($AR$117:AW144,$D$117:I144)/$AC$33),0))","v":0}]
[null,29,null,null,null,null,null,null,null,null,null,{"$error":"#DIV/0!"},{"$error":"#DIV/0!"},{"$error":"#DIV/0!"},{"$error":"#DIV/0!"},0,0,null,null,null,null,null,0,null,null,null,null,null,{"$f":"IF('2.Vorderingsstaat'!$AC$6=TRUE,\"BTW verlegd\",W145*$BA$19)","v":"BTW verlegd"},null,null,null,null,null,{"$f":"IF('2.Vorderingsstaat'!$AC$6=TRUE,\"BTW verlegd\",AC145+W145)","v":"BTW verlegd"},null,null,null,null,null,null,29,null,null,null,null,null,null,null,null,null,null,null,null,null,0,null,null,null,null,null,{"$f":"IF('2.Vorderingsstaat'!$AC$6=TRUE,\"BTW verlegd\",BD145*$BA$19)","v":"BTW verlegd"},null,null,null,null,null,{"$f":"IF('2.Vorderingsstaat'!$AC$6=TRUE,\"BTW verlegd\",BJ145+BD145)","v":"BTW verlegd"},null,null,null,null,null,{"$f":"IF(D145=\"\",0,IFERROR((SUM($AR$117:AW145,$D$117:I145)/$AC$33),0))","v":0}]
[null,30,null,null,null,null,null,null,null,null,null,{"$error":"#DIV/0!"},{"$error":"#DIV/0!"},{"$error":"#DIV/0!"},{"$error":"#DIV/0!"},0,0,null,null,null,null,null,0,null,null,null,null,null,{"$f":"IF('2.Vorderingsstaat'!$AC$6=TRUE,\"BTW verlegd\",W146*$BA$19)","v":"BTW verlegd"},null,null,null,null,null,{"$f":"IF('2.Vorderingsstaat'!$AC$6=TRUE,\"BTW verlegd\",AC146+W146)","v":"BTW verlegd"},null,null,null,null,null,null,30,null,null,null,null,null,null,null,null,null,null,null,null,null,0,null,null,null,null,null,{"$f":"IF('2.Vorderingsstaat'!$AC$6=TRUE,\"BTW verlegd\",BD146*$BA$19)","v":"BTW verlegd"},null,null,null,null,null,{"$f":"IF('2.Vorderingsstaat'!$AC$6=TRUE,\"BTW verlegd\",BJ146+BD146)","v":"BTW verlegd"},null,null,null,null,null,{"$f":"IF(D146=\"\",0,IFERROR((SUM($AR$117:AW146,$D$117:I146)/$AC$33),0))","v":0}]

{"sheet":"2.Vorderingsstaat","index":4,"n_rows":61,"n_cols":39,"rows_kept":61,"cut":false,"hidden":false,"merged":[[57,31,57,36],[54,1,54,36],[55,1,55,30],[56,1,56,30],[57,1,57,30],[51,31,51,36],[52,31,52,36],[41,1,41,12],[42,1,42,12],[50,1,50,36],[47,8,47,14],[48,8,48,14],[44,8,44,12],[45,8,45,12],[46,8,46,12],[45,1,45,7],[47,1,48,7],[46,1,46,7],[47,15,47,17],[48,15,48,17],[44,13,44,17],[44,1,44,7],[47,20,48,26],[45,13,45,17],[26,32,27,36],[28,32,31,36],[10,27,10,28],[11,27,11,28],[12,27,12,28],[13,27,13,28],[10,29,10,31],[11,29,11,31],[12,29,12,31],[31,29,31,31],[13,29,13,31],[15,27,15,31],[23,27,23,31],[14,27,14,31],[19,27,19,28],[20,27,20,28],[21,27,21,28],[22,27,22,28],[22,29,22,31],[21,29,21,31],[24,23,24,26],[24,27,24,31],[20,23,20,26],[10,32,13,36],[14,32,15,36],[17,32,18,36],[19,32,22,36],[23,32,24,36],[23,1,24,5],[23,6,23,7],[23,8,23,12],[23,13,23,17],[23,18,23,22],[19,1,22,5],[24,6,24,7],[24,8,24,12],[24,13,24,17],[24,18,24,22],[19,13,20,17],[21,13,22,17],[19,20,19,22],[22,20,22,22],[19,18,19,19],[10,18,10,19],[43,13,43,17],[43,20,43,26],[42,20,42,31],[41,20,41,31],[10,8,11,12],[33,27,33,31],[33,23,33,26],[32,1,33,5],[32,6,32,7],[32,8,32,12],[32,13,32,17],[30,27,30,28],[31,27,31,28],[28,29,28,31],[29,29,29,31],[30,29,30,31],[29,27,29,28],[28,23,28,26],[28,1,31,5],[33,6,33,7],[33,8,33,12],[28,27,28,28],[25,1,25,36],[16,1,16,36],[46,13,46,17],[20,18,20,19],[21,18,21,19],[22,18,22,19],[27,6,27,7],[27,8,27,12],[27,13,27,17],[35,1,35,17],[30,6,31,7],[29,18,29,19],[30,18,30,19],[31,18,31,19],[26,18,26,22],[30,8,31,12],[28,13,29,17],[30,13,31,17],[28,20,28,22],[29,20,29,22],[30,20,30,22],[26,8,26,12],[19,6,20,7],[21,6,22,7],[21,8,22,12],[19,8,20,12],[11,18,11,19],[9,23,9,26],[10,23,10,26],[11,23,11,26],[18,23,18,26],[10,20,10,22],[11,20,11,22],[14,23,14,26],[15,23,15,26],[17,23,17,26],[12,23,12,26],[13,23,13,26],[17,18,17,22],[18,18,18,22],[14,18,14,22],[15,18,15,22],[12,18,12,19],[13,18,13,19],[12,20,12,22],[13,20,13,22],[6,32,6,36],[6,27,6,31],[6,18,6,22],[8,27,8,31],[9,18,9,22],[6,23,6,26],[8,23,8,26],[9,27,9,31],[8,18,8,22],[7,1,7,36],[8,32,9,36],[9,8,9,12],[10,6,11,7],[10,13,11,17],[12,13,13,17],[12,6,13,7],[12,8,13,12],[10,1,13,5],[4,3,4,5],[4,11,4,13],[4,15,4,17],[6,1,6,7],[6,8,6,12],[6,13,6,17],[8,1,9,5],[8,6,8,7],[8,8,8,12],[8,13,8,17],[9,6,9,7],[9,13,9,17],[14,1,15,5],[14,6,14,7],[14,8,14,12],[14,13,14,17],[15,6,15,7],[15,8,15,12],[15,13,15,17],[17,13,17,17],[20,20,20,22],[21,20,21,22],[18,6,18,7],[18,8,18,12],[18,13,18,17],[17,1,18,5],[17,6,17,7],[17,8,17,12],[19,29,19,31],[20,29,20,31],[17,27,17,31],[18,27,18,31],[38,1,38,12],[40,1,40,12],[33,13,33,17],[33,18,33,22],[36,32,36,36],[37,32,37,36],[38,32,38,36],[40,32,40,36],[19,23,19,26],[22,23,22,26],[23,23,23,26],[27,27,27,31],[26,27,26,31],[26,23,26,26],[27,23,27,26],[26,1,27,5],[27,18,27,22],[26,13,26,17],[26,6,26,7],[28,6,29,7],[28,8,29,12],[29,23,29,26],[31,20,31,22],[21,23,21,26],[43,32,43,36],[44,32,44,36],[45,32,45,36],[28,18,28,19],[32,18,32,22],[32,23,32,26],[44,27,44,31],[35,20,35,36],[31,23,31,26],[30,23,30,26],[53,1,53,30],[55,31,55,36],[56,31,56,36],[32,32,33,36],[32,27,32,31],[40,20,40,31],[38,20,38,31],[37,20,37,31],[36,20,36,31],[39,20,39,36],[47,34,47,36],[41,13,41,17],[42,13,42,17],[36,13,36,17],[37,13,37,17],[38,13,38,17],[40,13,40,17],[39,1,39,17],[36,1,36,12],[37,1,37,12],[41,32,41,36],[42,32,42,36],[43,27,43,31],[45,27,45,31],[8,0,15,0],[58,16,58,31],[59,22,59,36],[61,32,61,36],[26,0,33,0],[17,0,24,0],[60,27,60,31],[60,32,60,36],[60,22,60,26],[48,34,48,36],[45,20,45,26],[44,20,44,26],[61,27,61,31],[61,22,61,26],[59,1,59,5],[59,6,59,10],[59,11,59,15],[47,27,47,32],[46,20,46,26],[46,27,46,31],[46,32,46,36],[53,31,53,36],[51,1,51,30],[52,1,52,30]]}
[null,{"$f":"CONCATENATE(\"VORDERINGSSTAAT \",'1.Overzicht vorderingsstaat'!AR3)","v":"VORDERINGSSTAAT 0"}]
[]
[null,{"$f":"CONCATENATE(\"Dossier : \",'0.basisgegevens'!B2,\" - \",'0.basisgegevens'!B3)","v":"Dossier :  - "},null,null,null,null,null,null,null,null,null,null,null,null,null,null,null,{"$f":"CONCATENATE(\"Perceel : \",'0.basisgegevens'!B4,\" - \",'0.basisgegevens'!B5)","v":"Perceel :  - "}]
[]
[null,"Datum :",null,{"$f":"'1.Overzicht vorderingsstaat'!AR8","v":"00:00:00"},null,null,null,null,null,null,"Periode : Van ",{"$f":"'1.Overzicht vorderingsstaat'!AR6","v":"00:00:00"},null,null,"tot",{"$f":"'1.Overzicht vorderingsstaat'!AR7","v":"00:00:00"}]
[null,null,null,null,null,null,null,null,null,null,null,null,null,null,null,null,null,null,null,null,null,null,null,null,null,null,null,null,{"$f":"'1.Overzicht vorderingsstaat'!$AV$10","v":true}]
[null,"Overzicht",null,null,null,null,null,null,"Vordering excl. BTW",null,null,null,null,"Herzieningen",null,null,null,null,"Vordering excl.BTW, Incl herziening",null,null,null,null,"BTW",null,null,null,"Te betalen",null,null,null,null,"Totalen"]
[null,"Algemene totalen vorige staten"]
["Totalen vorige staten","Deel UZL",null,null,null,null,"Deel A",null,{"$f":"'1.Overzicht vorderingsstaat'!AL19","v":0},null,null,null,null,{"$f":"'1.Overzicht vorderingsstaat'!AS19","v":0},null,null,null,null,{"$f":"I9+N9","v":0},null,null,null,null,{"$f":"IF($AC$6=TRUE,\"BTW verlegd\",((S9)*'1.Overzicht vorderingsstaat'!$BA$19))","v":"BTW verlegd"},null,null,null,{"$f":"IF($AC$6=TRUE,S9,S9+X9)","v":0},null,null,null,null,{"$f":"AB9+AB10","v":0}]
[null,null,null,null,null,null,"Deel B",null,{"$f":"'1.Overzicht vorderingsstaat'!AL20","v":0},null,null,null,null,{"$f":"'1.Overzicht vorderingsstaat'!AS20","v":0},null,null,null,null,{"$f":"I10+N10","v":0},null,null,null,null,{"$f":"IF($AC$6=TRUE,\"BTW verlegd\",((S10)*'1.Overzicht vorderingsstaat'!$BA$19))","v":"BTW verlegd"},null,null,null,{"$f":"IF($AC$6=TRUE,S10,S10+X10)","v":0}]
[null,"Deel Gemeenschappelijk",null,null,null,null,"Deel A",null,{"$f":"'1.Overzicht vorderingsstaat'!AL29","v":0},null,null,null,null,{"$f":"'1.Overzicht vorderingsstaat'!AS29","v":0},null,null,null,null,"UZL",null,{"$f":"(I11+N11)*'1.Overzicht vorderingsstaat'!$Z$24","v":0},null,null,{"$f":"IF($AC$6=TRUE,\"BTW verlegd\",((U11)*'1.Overzicht vorderingsstaat'!$BA$19))","v":"BTW verlegd"},null,null,null,"UZL",null,{"$f":"IF($AC$6=TRUE,U11,U11+X11)","v":0},null,null,{"$f":"CONCATENATE(\"UZL: \",DOLLAR(AM11),\" Derden: \",DOLLAR(AM12))","v":"UZL: € 0.00 Derden: € 0.00"},null,null,null,null,"UZL",{"$f":"AD11+AD13","v":0}]
[null,null,null,null,null,null,null,null,null,null,null,null,null,null,null,null,null,null,"Derden",null,{"$f":"(I11+N11)*'1.Overzicht vorderingsstaat'!$Z$25","v":0},null,null,{"$f":"IF($AC$6=TRUE,\"BTW verlegd\",((U12)*'1.Overzicht vorderingsstaat'!$BA$37))","v":"BTW verlegd"},null,null,null,"Derden",null,{"$f":"IF($AC$6=TRUE,U12,U12+X12)","v":0},null,null,null,null,null,null,null,"Derden",{"$f":"AD12+AD14","v":0}]
[null,null,null,null,null,null,"Deel B",null,{"$f":"'1.Overzicht vorderingsstaat'!AL30","v":0},null,null,null,null,{"$f":"'1.Overzicht vorderingsstaat'!AS30","v":0},null,null,null,null,"UZL",null,{"$f":"(I13+N13)*'1.Overzicht vorderingsstaat'!$Z$24","v":0},null,null,{"$f":"IF($AC$6=TRUE,\"BTW verlegd\",((U13)*'1.Overzicht vorderingsstaat'!$BA$19))","v":"BTW verlegd"},null,null,null,"UZL",null,{"$f":"IF($AC$6=TRUE,U13,U13+X13)","v":0}]
[null,null,null,null,null,null,null,null,null,null,null,null,null,null,null,null,null,null,"Derden",null,{"$f":"(I13+N13)*'1.Overzicht vorderingsstaat'!$Z$25","v":0},null,null,{"$f":"IF($AC$6=TRUE,\"BTW verlegd\",((U14)*'1.Overzicht vorderingsstaat'!$BA$37))","v":"BTW verlegd"},null,null,null,"Derden",null,{"$f":"IF($AC$6=TRUE,U14,U14+X14)","v":0}]
[null,"Deel Derden",null,null,null,null,"Deel A",null,{"$f":"'1.Overzicht vorderingsstaat'!AL37","v":0},null,null,null,null,{"$f":"'1.Overzicht vorderingsstaat'!AS37","v":0},null,null,null,null,{"$f":"I15+N15","v":0},null,null,null,null,{"$f":"IF($AC$6=TRUE,\"BTW verlegd\",((S15)*'1.Overzicht vorderingsstaat'!$BA$37))","v":"BTW verlegd"},null,null,null,{"$f":"IF($AC$6=TRUE,S15,S15+X15)","v":0},null,null,null,null,{"$f":"AB15+AB16","v":0}]
[null,null,null,null,null,null,"Deel B",null,{"$f":"'1.Overzicht vorderingsstaat'!AL38","v":0},null,null,null,null,{"$f":"'1.Overzicht vorderingsstaat'!AS38","v":0},null,null,null,null,{"$f":"I16+N16","v":0},null,null,null,null,{"$f":"IF($AC$6=TRUE,\"BTW verlegd\",((S16)*'1.Overzicht vorderingsstaat'!$BA$37))","v":"BTW verlegd"},null,null,null,{"$f":"IF($AC$6=TRUE,S16,S16+X16)","v":0}]
[null,{"$f":"CONCATENATE(\"Totalen huidige staat nr. \",'1.Overzicht vorderingsstaat'!AR3)","v":"Totalen huidige staat nr. 0"}]
[{"$f":"CONCATENATE(\"Totalen huidige staat nr. \",'1.Overzicht vorderingsstaat'!AR3)","v":"Totalen huidige staat nr. 0"},"Deel UZL",null,null,null,null,"Deel A",null,{"$f":"'1.Overzicht vorderingsstaat'!I19:V19","v":0},null,null,null,null,{"$f":"'1.Overzicht vorderingsstaat'!W19","v":0},null,null,null,null,{"$f":"I18+N18","v":0},null,null,null,null,{"$f":"IF($AC$6=TRUE,\"BTW verlegd\",((S18)*'1.Overzicht vorderingsstaat'!$BA$19))","v":"BTW verlegd"},null,null,null,{"$f":"IF($AC$6=TRUE,S18,S18+X18)","v":0},null,null,null,null,{"$f":"AB18+AB19","v":0}]
[null,null,null,null,null,null,"Deel B",null,{"$f":"'1.Overzicht vorderingsstaat'!I20:V20","v":0},null,null,null,null,{"$f":"'1.Overzicht vorderingsstaat'!W20","v":0},null,null,null,null,{"$f":"I19+N19","v":0},null,null,null,null,{"$f":"IF($AC$6=TRUE,\"BTW verlegd\",((S19)*'1.Overzicht vorderingsstaat'!$BA$19))","v":"BTW verlegd"},null,null,null,{"$f":"IF($AC$6=TRUE,S19,S19+X19)","v":0}]
[null,"Deel Gemeenschappelijk",null,null,null,null,"Deel A",null,{"$f":"'1.Overzicht vorderingsstaat'!I29:V29","v":0},null,null,null,null,{"$f":"'1.Overzicht vorderingsstaat'!W29","v":0},null,null,null,null,"UZL",null,{"$f":"(I20+N20)*'1.Overzicht vorderingsstaat'!$Z$24","v":0},null,null,{"$f":"IF($AC$6=TRUE,\"BTW verlegd\",((U20)*'1.Overzicht vorderingsstaat'!$BA$19))","v":"BTW verlegd"},null,null,null,"UZL",null,{"$f":"IF($AC$6=TRUE,U20,U20+X20)","v":0},null,null,{"$f":"CONCATENATE(\"UZL:\",DOLLAR(AM20),\"  Derden:\",DOLLAR(AM21))","v":"UZL:€ 0.00  Derden:€ 0.00"},null,null,null,null,"UZL",{"$f":"AD20+AD22","v":0}]
[null,null,null,null,null,null,null,null,null,null,null,null,null,null,null,null,null,null,"Derden",null,{"$f":"(I20+N20)*'1.Overzicht vorderingsstaat'!$Z$25","v":0},null,null,{"$f":"IF($AC$6=TRUE,\"BTW verlegd\",((U21)*'1.Overzicht vorderingsstaat'!$BA$37))","v":"BTW verlegd"},null,null,null,"Derden",null,{"$f":"IF($AC$6=TRUE,U21,U21+X21)","v":0},null,null,null,null,null,null,null,"Derden",{"$f":"AD21+AD23","v":0}]
[null,null,null,null,null,null,"Deel B",null,{"$f":"'1.Overzicht vorderingsstaat'!I30:V30","v":0},null,null,null,null,{"$f":"'1.Overzicht vorderingsstaat'!W30","v":0},null,null,null,null,"UZL",null,{"$f":"(I22+N22)*'1.Overzicht vorderingsstaat'!$Z$24","v":0},null,null,{"$f":"IF($AC$6=TRUE,\"BTW verlegd\",((U22)*'1.Overzicht vorderingsstaat'!$BA$19))","v":"BTW verlegd"},null,null,null,"UZL",null,{"$f":"IF($AC$6=TRUE,U22,U22+X22)","v":0}]
[null,null,null,null,null,null,null,null,null,null,null,null,null,null,null,null,null,null,"Derden",null,{"$f":"(I22+N22)*'1.Overzicht vorderingsstaat'!$Z$25","v":0},null,null,{"$f":"IF($AC$6=TRUE,\"BTW verlegd\",((U23)*'1.Overzicht vorderingsstaat'!$BA$37))","v":"BTW verlegd"},null,null,null,"Derden",null,{"$f":"IF($AC$6=TRUE,U23,U23+X23)","v":0}]
[null,"Deel Derden",null,null,null,null,"Deel A",null,{"$f":"'1.Overzicht vorderingsstaat'!I37:V37","v":0},null,null,null,null,{"$f":"'1.Overzicht vorderingsstaat'!W37","v":0},null,null,null,null,{"$f":"I24+N24","v":0},null,null,null,null,{"$f":"IF($AC$6=TRUE,\"BTW verlegd\",((S24)*'1.Overzicht vorderingsstaat'!$BA$37))","v":"BTW verlegd"},null,null,null,{"$f":"IF($AC$6=TRUE,S24,S24+X24)","v":0},null,null,null,null,{"$f":"AB24+AB25","v":0}]
[null,null,null,null,null,null,"Deel B",null,{"$f":"'1.Overzicht vorderingsstaat'!I38:V38","v":0},null,null,null,null,{"$f":"'1.Overzicht vorderingsstaat'!W38","v":0},null,null,null,null,{"$f":"I25+N25","v":0},null,null,null,null,{"$f":"IF($AC$6=TRUE,\"BTW verlegd\",((S25)*'1.Overzicht vorderingsstaat'!$BA$37))","v":"BTW verlegd"},null,null,null,{"$f":"IF($AC$6=TRUE,S25,S25+X25)","v":0}]
[null,{"$f":"CONCATENATE(\"Algemene totalen inclusief staat nr. \",'1.Overzicht vorderingsstaat'!AR3)","v":"Algemene totalen inclusief staat nr. 0"}]
[{"$f":"CONCATENATE(\"Totalen alle staten Incl.nr. \",'1.Overzicht vorderingsstaat'!AR3)","v":"Totalen alle staten Incl.nr. 0"},"Deel UZL",null,null,null,null,"Deel A",null,{"$f":"I9+I18","v":0},null,null,null,null,{"$f":"N9+N18","v":0},null,null,null,null,{"$f":"I27+N27","v":0},null,null,null,null,{"$f":"IF($AC$6=TRUE,\"BTW verlegd\",((S27)*'1.Overzicht vorderingsstaat'!$BA$19))","v":"BTW verlegd"},null,null,null,{"$f":"IF($AC$6=TRUE,S27,S27+X27)","v":0},null,null,null,null,{"$f":"AB27+AB28","v":0}]
[null,null,null,null,null,null,"Deel B",null,{"$f":"I10+I19","v":0},null,null,null,null,{"$f":"N10+N19","v":0},null,null,null,null,{"$f":"I28+N28","v":0},null,null,null,null,{"$f":"IF($AC$6=TRUE,\"BTW verlegd\",((S28)*'1.Overzicht vorderingsstaat'!$BA$19))","v":"BTW verlegd"},null,null,null,{"$f":"IF($AC$6=TRUE,S28,S28+X28)","v":0}]
[null,"Deel gemeenschappelijk",null,null,null,null,"Deel A",null,{"$f":"I11+I20","v":0},null,null,null,null,{"$f":"N11+N20","v":0},null,null,null,null,"UZL",null,{"$f":"(I29+N29)*'1.Overzicht vorderingsstaat'!$Z$24","v":0},null,null,{"$f":"IF($AC$6=TRUE,\"BTW verlegd\",((U29)*'1.Overzicht vorderingsstaat'!$BA$19))","v":"BTW verlegd"},null,null,null,"UZL",null,{"$f":"IF($AC$6=TRUE,U29,U29+X29)","v":0},null,null,{"$f":"CONCATENATE(\"UZL:\",DOLLAR(AM29),\" Derden:\",DOLLAR(AM30))","v":"UZL:€ 0.00 Derden:€ 0.00"},null,null,null,null,"UZL",{"$f":"AD29+AD31","v":0}]
[null,null,null,null,null,null,null,null,null,null,null,null,null,null,null,null,null,null,"Derden",null,{"$f":"(I29+N29)*'1.Overzicht vorderingsstaat'!$Z$25","v":0},null,null,{"$f":"IF($AC$6=TRUE,\"BTW verlegd\",((U30)*'1.Overzicht vorderingsstaat'!$BA$37))","v":"BTW verlegd"},null,null,null,"Derden",null,{"$f":"IF($AC$6=TRUE,U30,U30+X30)","v":0},null,null,null,null,null,null,null,"Derden",{"$f":"AD30+AD32","v":0}]
[null,null,null,null,null,null,"Deel B",null,{"$f":"I13+I22","v":0},null,null,null,null,{"$f":"N13+N22","v":0},null,null,null,null,"UZL",null,{"$f":"(I31+N31)*'1.Overzicht vorderingsstaat'!$Z$24","v":0},null,null,{"$f":"IF($AC$6=TRUE,\"BTW verlegd\",((U31)*'1.Overzicht vorderingsstaat'!$BA$19))","v":"BTW verlegd"},null,null,null,"UZL",null,{"$f":"IF($AC$6=TRUE,U31,U31+X31)","v":0}]
[null,null,null,null,null,null,null,null,null,null,null,null,null,null,null,null,null,null,"Derden",null,{"$f":"(I31+N31)*'1.Overzicht vorderingsstaat'!$Z$25","v":0},null,null,{"$f":"IF($AC$6=TRUE,\"BTW verlegd\",((U32)*'1.Overzicht vorderingsstaat'!$BA$37))","v":"BTW verlegd"},null,null,null,"Derden",null,{"$f":"IF($AC$6=TRUE,U32,U32+X32)","v":0}]
[null,"Deel Derden",null,null,null,null,"Deel A",null,{"$f":"I15+I24","v":0},null,null,null,null,{"$f":"N15+N24","v":0},null,null,null,null,{"$f":"I33+N33","v":0},null,null,null,null,{"$f":"IF($AC$6=TRUE,\"BTW verlegd\",((S33)*'1.Overzicht vorderingsstaat'!$BA$37))","v":"BTW verlegd"},null,null,null,{"$f":"IF($AC$6=TRUE,S33,S33+X33)","v":0},null,null,null,null,{"$f":"AB33+AB34","v":0}]
[null,null,null,null,null,null,"Deel B",null,{"$f":"I16+I25","v":0},null,null,null,null,{"$f":"N16+N25","v":0},null,null,null,null,{"$f":"I34+N34","v":0},null,null,null,null,{"$f":"IF($AC$6=TRUE,\"BTW verlegd\",((S34)*'1.Overzicht vorderingsstaat'!$BA$37))","v":"BTW verlegd"},null,null,null,{"$f":"IF($AC$6=TRUE,S34,S34+X34)","v":0}]
[]
[null,{"$f":"CONCATENATE(\"Totaal vorderingsstaat deel UZL\",\": VS nr \",'1.Overzicht vorderingsstaat'!AR3)","v":"Totaal vorderingsstaat deel UZL: VS nr 0"},null,null,null,null,null,null,null,null,null,null,null,null,null,null,null,null,null,null,{"$f":"CONCATENATE(\"Totaal vorderingsstaat deel derden\",\": VS nr \",'1.Overzicht vorderingsstaat'!AR3)","v":"Totaal vorderingsstaat deel derden: VS nr 0"}]
[null,"Deel A + Deel B excl. BTW",null,null,null,null,null,null,null,null,null,null,null,{"$f":"S18+S19+U20+U22","v":0},null,null,null,null,null,null,"Deel A + Deel B excl. BTW",null,null,null,null,null,null,null,null,null,null,null,{"$f":"U21+U23+S24+S25","v":0}]
[null,"Deel A + Deel B incl. BTW",null,null,null,null,null,null,null,null,null,null,null,{"$f":"N37*(1+'1.Overzicht vorderingsstaat'!$BA$19)","v":0},null,null,null,null,null,null,"Deel A + Deel B incl. BTW",null,null,null,null,null,null,null,null,null,null,null,{"$f":"AG37*(1+'1.Overzicht vorderingsstaat'!$BA$37)","v":0}]
[null,"Te betalen",null,null,null,null,null,null,null,null,null,null,null,{"$f":"AB18+AB19+AD20+AD22","v":0},null,null,null,null,null,null,"Te betalen",null,null,null,null,null,null,null,null,null,null,null,{"$f":"AD21+AD23+AB24+AB25","v":0}]
[null,{"$f":"CONCATENATE(\"Algemene totalen UZL inclusief staat nr. \",'1.Overzicht vorderingsstaat'!AR3)","v":"Algemene totalen UZL inclusief staat nr. 0"},null,null,null,null,null,null,null,null,null,null,null,null,null,null,null,null,null,null,{"$f":"CONCATENATE(\"Algemene totalen  deel derden inclusief staat nr. \",'1.Overzicht vorderingsstaat'!AR3)","v":"Algemene totalen  deel derden inclusief staat nr. 0"}]
[null,"Deel A + Deel B excl. BTW",null,null,null,null,null,null,null,null,null,null,null,{"$f":"S27+S28+U29+U31","v":0},null,null,null,null,null,null,"Deel A + Deel B excl. BTW",null,null,null,null,null,null,null,null,null,null,null,{"$f":"U30+U32+S33+S34","v":0}]
[null,"Deel A + Deel B incl. BTW",null,null,null,null,null,null,null,null,null,null,null,{"$f":"N41*(1+'1.Overzicht vorderingsstaat'!$BA$19)","v":0},null,null,null,null,null,null,"Deel A + Deel B incl. BTW",null,null,null,null,null,null,null,null,null,null,null,{"$f":"AG41*(1+'1.Overzicht vorderingsstaat'!$BA$37)","v":0}]
[null,"Totaal : ",null,null,null,null,null,null,null,null,null,null,null,{"$f":"AB27+AB28+AD29+AD31","v":0},null,null,null,null,null,null,"Totaal : ",null,null,null,null,null,null,null,null,null,null,null,{"$f":"AD30+AD32+AB33+AB34","v":0}]
[null,null,null,null,null,null,null,null,"Excl. BTW",null,null,null,null,"Incl. BTW",null,null,null,null,null,null,null,null,null,null,null,null,null,"Excl. BTW",null,null,null,null,"Incl. BTW"]
[null,"Basisbedrag aanbesteding :",null,null,null,null,null,null,{"$f":"'1.Overzicht vorderingsstaat'!AC15+'1.Overzicht vorderingsstaat'!AC24","v":0},null,null,null,null,{"$f":"IF($AC$6=TRUE,\"BTW verlegd\",(I45+(I45)*'1.Overzicht vorderingsstaat'!$BA$19))","v":"BTW verlegd"},null,null,null,null,null,null,"Basisbedrag van de aanbesteding :",null,null,null,null,null,null,{"$f":"'1.Overzicht vorderingsstaat'!AC33+'1.Overzicht vorderingsstaat'!AC25","v":0},null,null,null,null,{"$f":"IF($AC$6=TRUE,\"BTW verlegd\",(AB45+(AB45)*'1.Overzicht vorderingsstaat'!$BA$37))","v":"BTW verlegd"}]
[null,"Bedrag goedgekeurde wijzigingen :",null,null,null,null,null,null,{"$f":"I28+(I31*'1.Overzicht vorderingsstaat'!$Z$24)","v":0},null,null,null,null,{"$f":"IF($AC$6=TRUE,\"BTW verlegd\",(I46+(I46)*'1.Overzicht vorderingsstaat'!$BA$19))","v":"BTW verlegd"},null,null,null,null,null,null,"Bedrag goedgekeurde wijzigingen :",null,null,null,null,null,null,{"$f":"I34+(I31*'1.Overzicht vorderingsstaat'!$Z$25)","v":0},null,null,null,null,{"$f":"IF($AC$6=TRUE,\"BTW verlegd\",(AB46+(AB46)*'1.Overzicht vorderingsstaat'!$BA$37))","v":"BTW verlegd"}]
[null,"Huidig bedrag aanbesteding :",null,null,null,null,null,null,{"$f":"I45+I46","v":0},null,null,null,null,{"$f":"IF($AC$6=TRUE,\"BTW verlegd\",(I47+(I47)*'1.Overzicht vorderingsstaat'!$BA$19))","v":"BTW verlegd"},null,null,null,null,null,null,"Huidig bedrag van de aanbesteding :",null,null,null,null,null,null,{"$f":"AB45+AB46","v":0},null,null,null,null,{"$f":"IF($AC$6=TRUE,\"BTW verlegd\",(AB47+(AB47)*'1.Overzicht vorderingsstaat'!$BA$37))","v":"BTW verlegd"}]
[null,"% tav basisbedrag aanbesteding (incl.BTW) :",null,null,null,null,null,null,"Excl. goedgekeurde wijzigingen :",null,null,null,null,null,null,{"$f":"IFERROR(((I27*(1+'1.Overzicht vorderingsstaat'!BA19)))/(I45+(I45)*'1.Overzicht vorderingsstaat'!$BA$19),0)","v":0},null,null,null,null,"% tav basisbedrag v/d aanbesteding (incl.BTW) :",null,null,null,null,null,null,"Excl. goedgekeurde wijzigingen :",null,null,null,null,null,null,{"$f":"IFERROR(((I33*(1+'1.Overzicht vorderingsstaat'!BA37)))/(AB45+(AB45)*'1.Overzicht vorderingsstaat'!$BA$37),0)","v":0}]
[null,null,null,null,null,null,null,null,"Incl. goedgekeurde wijzigingen :",null,null,null,null,null,null,{"$f":"IFERROR(((I27+I28)*(1+'1.Overzicht vorderingsstaat'!BA19))/(I45+(I45)*'1.Overzicht vorderingsstaat'!$BA$19),0)","v":0},null,null,null,null,null,null,null,null,null,null,null,"Incl. goedgekeurde wijzigingen :",null,null,null,null,null,null,{"$f":"IFERROR(((I33+I34)*(1+'1.Overzicht vorderingsstaat'!BA37))/(AB45+(AB45)*'1.Overzicht vorderingsstaat'!$BA$37),0)","v":0}]
[]
[null,{"$f":"CONCATENATE(\"Totaal vorderingsstaat \",\": VS nr \",'1.Overzicht vorderingsstaat'!AR3)","v":"Totaal vorderingsstaat : VS nr 0"}]
[null,"Deel A + Deel B excl. BTW",null,null,null,null,null,null,null,null,null,null,null,null,null,null,null,null,null,null,null,null,null,null,null,null,null,null,null,null,null,{"$f":"N37+AG37","v":0}]
[null,"Deel A + Deel B incl. BTW",null,null,null,null,null,null,null,null,null,null,null,null,null,null,null,null,null,null,null,null,null,null,null,null,null,null,null,null,null,{"$f":"N38+AG38","v":0}]
[null,"Te betalen",null,null,null,null,null,null,null,null,null,null,null,null,null,null,null,null,null,null,null,null,null,null,null,null,null,null,null,null,null,{"$f":"N39+AG39","v":0}]
[null,{"$f":"CONCATENATE(\"Algemene totalen inclusief staat nr. \",'1.Overzicht vorderingsstaat'!AR3)","v":"Algemene totalen inclusief staat nr. 0"}]
[null,"Deel A + Deel B excl. BTW",null,null,null,null,null,null,null,null,null,null,null,null,null,null,null,null,null,null,null,null,null,null,null,null,null,null,null,null,null,{"$f":"N41+AG41","v":0}]
[null,"Deel A + Deel B incl. BTW",null,null,null,null,null,null,null,null,null,null,null,null,null,null,null,null,null,null,null,null,null,null,null,null,null,null,null,null,null,{"$f":"N42+AG42","v":0}]
[null,"Totaal :",null,null,null,null,null,null,null,null,null,null,null,null,null,null,null,null,null,null,null,null,null,null,null,null,null,null,null,null,null,{"$f":"N43+AG43","v":0}]
[]
[null,"Aannemer",null,null,null,null,"Uitvoeringscoördinator",null,null,null,null,"Ontwerper",null,null,null,null,"Derden",null,null,null,null,null,"Bouwheer (vul aan met datum + handtekening)"]
[null,{"$f":"'0.basisgegevens'!B10","v":0},null,null,null,null,{"$f":"'0.basisgegevens'!B8","v":0},null,null,null,null,{"$f":"'0.basisgegevens'!B9","v":0},null,null,null,null,{"$f":"'0.basisgegevens'!B11","v":0},null,null,null,null,null,{"$f":"'0.basisgegevens'!B6","v":0},null,null,null,null,{"$f":"'0.basisgegevens'!B7","v":0},null,null,null,null,"Leidend Ambtenaar"]

{"sheet":"3.VS-A","index":5,"n_rows":4000,"n_cols":15,"rows_kept":4000,"cut":false,"hidden":false,"merged":[[5,5,5,8],[5,9,7,9],[5,10,5,13],[6,5,7,5],[6,6,6,8],[6,10,7,10],[6,11,6,13],[5,4,7,4],[0,1,1,1],[5,0,7,0],[5,1,7,1],[5,2,7,2],[5,3,7,3]]}
[null,{"$f":"CONCATENATE(\"OVERZICHT VORDERINGSSTAAT \",'1.Overzicht vorderingsstaat'!AR3,\" - DEEL A\")","v":"OVERZICHT VORDERINGSSTAAT 0 - DEEL A"},null,null,null,null,null,null,null,null,null,null,"Datum : ",{"$f":"'1.Overzicht vorderingsstaat'!AR8","v":"00:00:00"}]
[null,null,null,null,null,null,null,null,null,null,null,null,"Projectingenieur : ",{"$f":"'0.basisgegevens'!B6","v":0}]
["TE",{"$f":"'0.basisgegevens'!B2","v":0}]
["Titel",{"$f":"'0.basisgegevens'!B3","v":0}]
[null,null,null,null,null,null,null,null,null,"TOTAAL excl. BTW",{"$f":"IFERROR(IF(SUM(K9:K4000)<>0,SUM(K9:K4000),\"\"),\"\")","v":""},{"$f":"IFERROR(IF(SUM(L9:L4000)<>0,SUM(L9:L4000),\"\"),\"\")","v":""},{"$f":"IFERROR(IF(SUM(M9:M4000)<>0,SUM(M9:M4000),\"\"),\"\")","v":""},{"$f":"IFERROR(IF(SUM(N9:N4000)<>0,SUM(N9:N4000),\"\"),\"\")","v":""}]
["Artnr","Omschrijving","Herziening","Meting","EH","HOEVEELHEDEN",null,null,null,"Eenh.prijs \n(excl. BTW)","BEDRAGEN"]
[null,null,null,null,null,"Voorziene hoeveelheid","Uitgevoerde hoeveelheden",null,null,null,"Voorzien bedrag","Uitgevoerde bedragen"]
[null,null,null,null,null,null,"Vorige periode","Huidige periode","Cumul",null,null,"Vorige periode","Huidige periode","Cumul","afdrukbereik filter"]
[null,null,null,null,null,null,null,null,{"$f":"IFERROR(G9+H9,\"\")","v":0},null,{"$f":"IFERROR(IF(J9<>\"\",F9*J9,\"\"),\"\")","v":""},{"$f":"IFERROR(IF(J9<>\"\",G9*J9,\"\"),\"\")","v":""},{"$f":"IFERROR(IF(J9<>\"\",H9*J9,\"\"),\"\")","v":""},{"$f":"IFERROR(L9+M9,\"\")","v":""}]
[null,null,null,null,null,null,null,null,{"$f":"IFERROR(G10+H10,\"\")","v":0},null,{"$f":"IFERROR(IF(J10<>\"\",F10*J10,\"\"),\"\")","v":""},{"$f":"IFERROR(IF(J10<>\"\",G10*J10,\"\"),\"\")","v":""},{"$f":"IFERROR(IF(J10<>\"\",H10*J10,\"\"),\"\")","v":""},{"$f":"IFERROR(L10+M10,\"\")","v":""}]
[null,null,null,null,null,null,null,null,0,null,"","","",""]
[null,null,null,null,null,null,null,null,0,null,"","","",""]
[null,null,null,null,null,null,null,null,0,null,"","","",""]
[null,null,null,null,null,null,null,null,0,null,"","","",""]
[null,null,null,null,null,null,null,null,0,null,"","","",""]
[null,null,null,null,null,null,null,null,0,null,"","","",""]
[null,null,null,null,null,null,null,null,0,null,"","","",""]
[null,null,null,null,null,null,null,null,null,null,"","","",""]
[null,null,null,null,null,null,null,null,null,null,"","","",""]
[null,null,null,null,null,null,null,null,null,null,"","","",""]
[null,null,null,null,null,null,null,null,null,null,"","","",""]
[null,null,null,null,null,null,null,null,null,null,"","","",""]
[null,null,null,null,null,null,null,null,null,null,"","","",""]
[null,null,null,null,null,null,null,null,null,null,"","","",""]
[null,null,null,null,null,null,null,null,null,null,"","","",""]
[null,null,null,null,null,null,null,null,null,null,"","","",""]
[null,null,null,null,null,null,null,null,null,null,"","","",""]
[null,null,null,null,null,null,null,null,null,null,"","","",""]
[null,null,null,null,null,null,null,null,null,null,"","","",""]
[null,null,null,null,null,null,null,null,null,null,"","","",""]
[null,null,null,null,null,null,null,null,null,null,"","","",""]
[null,null,null,null,null,null,null,null,null,null,"","","",""]
[null,null,null,null,null,null,null,null,null,null,"","","",""]
[null,null,null,null,null,null,null,null,null,null,"","","",""]
[null,null,null,null,null,null,null,null,0,null,"","","",""]
[null,null,null,null,null,null,null,null,0,null,"","","",""]
[null,null,null,null,null,null,null,null,0,null,"","","",""]
[null,null,null,null,null,null,null,null,0,null,"","","",""]
[null,null,null,null,null,null,null,null,0,null,"","","",""]
[null,null,null,null,null,null,null,null,0,null,"","","",""]
[null,null,null,null,null,null,null,null,0,null,"","","",""]
[null,null,null,null,null,null,null,null,0,null,"","","",""]
[null,null,null,null,null,null,null,null,0,null,"","","",""]
[null,null,null,null,null,null,null,null,0,null,"","","",""]
[null,null,null,null,null,null,null,null,0,null,"","","",""]
[null,null,null,null,null,null,null,null,0,null,"","","",""]
[null,null,null,null,null,null,null,null,0,null,"","","",""]
[null,null,null,null,null,null,null,null,0,null,"","","",""]
[null,null,null,null,null,null,null,null,0,null,"","","",""]
[null,null,null,null,null,null,null,null,0,null,"","","",""]
[null,null,null,null,null,null,null,null,0,null,"","","",""]
[null,null,null,null,null,null,null,null,0,null,"","","",""]
[null,null,null,null,null,null,null,null,0,null,"","","",""]
[null,null,null,null,null,null,null,null,0,null,"","","",""]
[null,null,null,null,null,null,null,null,0,null,"","","",""]
[null,null,null,null,null,null,null,null,0,null,"","","",""]
[null,null,null,null,null,null,null,null,0,null,"","","",""]
[null,null,null,null,null,null,null,null,0,null,"","","",""]
[null,null,null,null,null,null,null,null,0,null,"","","",""]
[null,null,null,null,null,null,null,null,0,null,"","","",""]
[null,null,null,null,null,null,null,null,0,null,"","","",""]
[null,null,null,null,null,null,null,null,0,null,"","","",""]
[null,null,null,null,null,null,null,null,0,null,"","","",""]
[null,null,null,null,null,null,null,null,0,null,"","","",""]
[null,null,null,null,null,null,null,null,0,null,"","","",""]
[null,null,null,null,null,null,null,null,0,null,"","","",""]
[null,null,null,null,null,null,null,null,0,null,"","","",""]
[null,null,null,null,null,null,null,null,0,null,"","","",""]
[null,null,null,null,null,null,null,null,0,null,"","","",""]
[null,null,null,null,null,null,null,null,0,null,"","","",""]
[null,null,null,null,null,null,null,null,0,null,"","","",""]
[null,null,null,null,null,null,null,null,0,null,"","","",""]
[null,null,null,null,null,null,null,null,0,null,"","","",""]
[null,null,null,null,null,null,null,null,{"$f":"IFERROR(G74+H74,\"\")","v":0},null,{"$f":"IFERROR(IF(J74<>\"\",F74*J74,\"\"),\"\")","v":""},{"$f":"IFERROR(IF(J74<>\"\",G74*J74,\"\"),\"\")","v":""},{"$f":"IFERROR(IF(J74<>\"\",H74*J74,\"\"),\"\")","v":""},{"$f":"IFERROR(L74+M74,\"\")","v":""}]
[null,null,null,null,null,null,null,null,0,null,"","","",""]
[null,null,null,null,null,null,null,null,0,null,"","","",""]
[null,null,null,null,null,null,null,null,0,null,"","","",""]
[null,null,null,null,null,null,null,null,0,null,"","","",""]
[null,null,null,null,null,null,null,null,0,null,"","","",""]
[null,null,null,null,null,null,null,null,0,null,"","","",""]
[null,null,null,null,null,null,null,null,0,null,"","","",""]
[null,null,null,null,null,null,null,null,0,null,"","","",""]
[null,null,null,null,null,null,null,null,0,null,"","","",""]
[null,null,null,null,null,null,null,null,0,null,"","","",""]
[null,null,null,null,null,null,null,null,0,null,"","","",""]
[null,null,null,null,null,null,null,null,0,null,"","","",""]
[null,null,null,null,null,null,null,null,0,null,"","","",""]
[null,null,null,null,null,null,null,null,0,null,"","","",""]
[null,null,null,null,null,null,null,null,0,null,"","","",""]
[null,null,null,null,null,null,null,null,0,null,"","","",""]
[null,null,null,null,null,null,null,null,0,null,"","","",""]
[null,null,null,null,null,null,null,null,0,null,"","","",""]
[null,null,null,null,null,null,null,null,0,null,"","","",""]
[null,null,null,null,null,null,null,null,0,null,"","","",""]
[null,null,null,null,null,null,null,null,0,null,"","","",""]
[null,null,null,null,null,null,null,null,0,null,"","","",""]
[null,null,null,null,null,null,null,null,0,null,"","","",""]
[null,null,null,null,null,null,null,null,0,null,"","","",""]
[null,null,null,null,null,null,null,null,0,null,"","","",""]
[null,null,null,null,null,null,null,null,0,null,"","","",""]
[null,null,null,null,null,null,null,null,0,null,"","","",""]
[null,null,null,null,null,null,null,null,0,null,"","","",""]
[null,null,null,null,null,null,null,null,0,null,"","","",""]
[null,null,null,null,null,null,null,null,0,null,"","","",""]
[null,null,null,null,null,null,null,null,0,null,"","","",""]
[null,null,null,null,null,null,null,null,0,null,"","","",""]
[null,null,null,null,null,null,null,null,0,null,"","","",""]
[null,null,null,null,null,null,null,null,0,null,"","","",""]
[null,null,null,null,null,null,null,null,0,null,"","","",""]
[null,null,null,null,null,null,null,null,0,null,"","","",""]
[null,null,null,null,null,null,null,null,0,null,"","","",""]
[null,null,null,null,null,null,null,null,0,null,"","","",""]
[null,null,null,null,null,null,null,null,0,null,"","","",""]
[null,null,null,null,null,null,null,null,0,null,"","","",""]
[null,null,null,null,null,null,null,null,0,null,"","","",""]
[null,null,null,null,null,null,null,null,0,null,"","","",""]
[null,null,null,null,null,null,null,null,0,null,"","","",""]
[null,null,null,null,null,null,null,null,0,null,"","","",""]
[null,null,null,null,null,null,null,null,0,null,"","","",""]
[null,null,null,null,null,null,null,null,0,null,"","","",""]
[null,null,null,null,null,null,null,null,0,null,"","","",""]
[null,null,null,null,null,null,null,null,0,null,"","","",""]
[null,null,null,null,null,null,null,null,0,null,"","","",""]
[null,null,null,null,null,null,null,null,0,null,"","","",""]
[null,null,null,null,null,null,null,null,0,null,"","","",""]
[null,null,null,null,null,null,null,null,0,null,"","","",""]
[null,null,null,null,null,null,null,null,0,null,"","","",""]
[null,null,null,null,null,null,null,null,0,null,"","","",""]
[null,null,null,null,null,null,null,null,0,null,"","","",""]
[null,null,null,null,null,null,null,null,0,null,"","","",""]
[null,null,null,null,null,null,null,null,0,null,"","","",""]
[null,null,null,null,null,null,null,null,0,null,"","","",""]
[null,null,null,null,null,null,null,null,0,null,"","","",""]
[null,null,null,null,null,null,null,null,0,null,"","","",""]
[null,null,null,null,null,null,null,null,0,null,"","","",""]
[null,null,null,null,null,null,null,null,0,null,"","","",""]
[null,null,null,null,null,null,null,null,0,null,"","","",""]
[null,null,null,null,null,null,null,null,{"$f":"IFERROR(G138+H138,\"\")","v":0},null,{"$f":"IFERROR(IF(J138<>\"\",F138*J138,\"\"),\"\")","v":""},{"$f":"IFERROR(IF(J138<>\"\",G138*J138,\"\"),\"\")","v":""},{"$f":"IFERROR(IF(J138<>\"\",H138*J138,\"\"),\"\")","v":""},{"$f":"IFERROR(L138+M138,\"\")","v":""}]
[null,null,null,null,null,null,null,null,0,null,"","","",""]
[null,null,null,null,null,null,null,null,0,null,"","","",""]
[null,null,null,null,null,null,null,null,0,null,"","","",""]
[null,null,null,null,null,null,null,null,0,null,"","","",""]
[null,null,null,null,null,null,null,null,0,null,"","","",""]
[null,null,null,null,null,null,null,null,0,null,"","","",""]
[null,null,null,null,null,null,null,null,0,null,"","","",""]
[null,null,null,null,null,null,null,null,0,null,"","","",""]
[null,null,null,null,null,null,null,null,0,null,"","","",""]
[null,null,null,null,null,null,null,null,0,null,"","","",""]
[null,null,null,null,null,null,null,null,0,null,"","","",""]
[null,null,null,null,null,null,null,null,0,null,"","","",""]
[null,null,null,null,null,null,null,null,0,null,"","","",""]
[null,null,null,null,null,null,null,null,0,null,"","","",""]
[null,null,null,null,null,null,null,null,0,null,"","","",""]
[null,null,null,null,null,null,null,null,0,null,"","","",""]
[null,null,null,null,null,null,null,null,0,null,"","","",""]
[null,null,null,null,null,null,null,null,0,null,"","","",""]
[null,null,null,null,null,null,null,null,0,null,"","","",""]
[null,null,null,null,null,null,null,null,0,null,"","","",""]
[null,null,null,null,null,null,null,null,0,null,"","","",""]
[null,null,null,null,null,null,null,null,0,null,"","","",""]
[null,null,null,null,null,null,null,null,0,null,"","","",""]
[null,null,null,null,null,null,null,null,0,null,"","","",""]
[null,null,null,null,null,null,null,null,0,null,"","","",""]
[null,null,null,null,null,null,null,null,0,null,"","","",""]
[null,null,null,null,null,null,null,null,0,null,"","","",""]
[null,null,null,null,null,null,null,null,0,null,"","","",""]
[null,null,null,null,null,null,null,null,0,null,"","","",""]
[null,null,null,null,null,null,null,null,0,null,"","","",""]
[null,null,null,null,null,null,null,null,0,null,"","","",""]
[null,null,null,null,null,null,null,null,0,null,"","","",""]
[null,null,null,null,null,null,null,null,0,null,"","","",""]
[null,null,null,null,null,null,null,null,0,null,"","","",""]
[null,null,null,null,null,null,null,null,0,null,"","","",""]
[null,null,null,null,null,null,null,null,0,null,"","","",""]
[null,null,null,null,null,null,null,null,0,null,"","","",""]
[null,null,null,null,null,null,null,null,0,null,"","","",""]
[null,null,null,null,null,null,null,null,0,null,"","","",""]
[null,null,null,null,null,null,null,null,0,null,"","","",""]
[null,null,null,null,null,null,null,null,0,null,"","","",""]
[null,null,null,null,null,null,null,null,0,null,"","","",""]
[null,null,null,null,null,null,null,null,0,null,"","","",""]
[null,null,null,null,null,null,null,null,0,null,"","","",""]
[null,null,null,null,null,null,null,null,0,null,"","","",""]
[null,null,null,null,null,null,null,null,0,null,"","","",""]
[null,null,null,null,null,null,null,null,0,null,"","","",""]
[null,null,null,null,null,null,null,null,0,null,"","","",""]
[null,null,null,null,null,null,null,null,0,null,"","","",""]
[null,null,null,null,null,null,null,null,0,null,"","","",""]
[null,null,null,null,null,null,null,null,0,null,"","","",""]
[null,null,null,null,null,null,null,null,0,null,"","","",""]
[null,null,null,null,null,null,null,null,0,null,"","","",""]
[null,null,null,null,null,null,null,null,0,null,"","","",""]
[null,null,null,null,null,null,null,null,0,null,"","","",""]
[null,null,null,null,null,null,null,null,0,null,"","","",""]
[null,null,null,null,null,null,null,null,0,null,"","","",""]
[null,null,null,null,null,null,null,null,0,null,"","","",""]
[null,null,null,null,null,null,null,null,0,null,"","","",""]
[null,null,null,null,null,null,null,null,0,null,"","","",""]
[null,null,null,null,null,null,null,null,0,null,"","","",""]
[null,null,null,null,null,null,null,null,0,null,"","","",""]
[null,null,null,null,null,null,null,null,0,null,"","","",""]
[null,null,null,null,null,null,null,null,{"$f":"IFERROR(G202+H202,\"\")","v":0},null,{"$f":"IFERROR(IF(J202<>\"\",F202*J202,\"\"),\"\")","v":""},{"$f":"IFERROR(IF(J202<>\"\",G202*J202,\"\"),\"\")","v":""},{"$f":"IFERROR(IF(J202<>\"\",H202*J202,\"\"),\"\")","v":""},{"$f":"IFERROR(L202+M202,\"\")","v":""}]
[null,null,null,null,null,null,null,null,0,null,"","","",""]
[null,null,null,null,null,null,null,null,0,null,"","","",""]
[null,null,null,null,null,null,null,null,0,null,"","","",""]
[null,null,null,null,null,null,null,null,0,null,"","","",""]
[null,null,null,null,null,null,null,null,0,null,"","","",""]
[null,null,null,null,null,null,null,null,0,null,"","","",""]
[null,null,null,null,null,null,null,null,0,null,"","","",""]
[null,null,null,null,null,null,null,null,0,null,"","","",""]
[null,null,null,null,null,null,null,null,0,null,"","","",""]
[null,null,null,null,null,null,null,null,0,null,"","","",""]
[null,null,null,null,null,null,null,null,0,null,"","","",""]
[null,null,null,null,null,null,null,null,0,null,"","","",""]
[null,null,null,null,null,null,null,null,0,null,"","","",""]
[null,null,null,null,null,null,null,null,0,null,"","","",""]
[null,null,null,null,null,null,null,null,0,null,"","","",""]
[null,null,null,null,null,null,null,null,0,null,"","","",""]
[null,null,null,null,null,null,null,null,0,null,"","","",""]
[null,null,null,null,null,null,null,null,0,null,"","","",""]
[null,null,null,null,null,null,null,null,0,null,"","","",""]
[null,null,null,null,null,null,null,null,0,null,"","","",""]
[null,null,null,null,null,null,null,null,0,null,"","","",""]
[null,null,null,null,null,null,null,null,0,null,"","","",""]
[null,null,null,null,null,null,null,null,0,null,"","","",""]
[null,null,null,null,null,null,null,null,0,null,"","","",""]
[null,null,null,null,null,null,null,null,0,null,"","","",""]
[null,null,null,null,null,null,null,null,0,null,"","","",""]
[null,null,null,null,null,null,null,null,0,null,"","","",""]
[null,null,null,null,null,null,null,null,0,null,"","","",""]
[null,null,null,null,null,null,null,null,0,null,"","","",""]
[null,null,null,null,null,null,null,null,0,null,"","","",""]
[null,null,null,null,null,null,null,null,0,null,"","","",""]
[null,null,null,null,null,null,null,null,0,null,"","","",""]
[null,null,null,null,null,null,null,null,0,null,"","","",""]
[null,null,null,null,null,null,null,null,0,null,"","","",""]
[null,null,null,null,null,null,null,null,0,null,"","","",""]
[null,null,null,null,null,null,null,null,0,null,"","","",""]
[null,null,null,null,null,null,null,null,0,null,"","","",""]
[null,null,null,null,null,null,null,null,0,null,"","","",""]
[null,null,null,null,null,null,null,null,0,null,"","","",""]
[null,null,null,null,null,null,null,null,0,null,"","","",""]
[null,null,null,null,null,null,null,null,0,null,"","","",""]
[null,null,null,null,null,null,null,null,0,null,"","","",""]
[null,null,null,null,null,null,null,null,0,null,"","","",""]
[null,null,null,null,null,null,null,null,0,null,"","","",""]
[null,null,null,null,null,null,null,null,0,null,"","","",""]
[null,null,null,null,null,null,null,null,0,null,"","","",""]
[null,null,null,null,null,null,null,null,0,null,"","","",""]
[null,null,null,null,null,null,null,null,0,null,"","","",""]
[null,null,null,null,null,null,null,null,0,null,"","","",""]
[null,null,null,null,null,null,null,null,0,null,"","","",""]
[null,null,null,null,null,null,null,null,0,null,"","","",""]
[null,null,null,null,null,null,null,null,0,null,"","","",""]
[null,null,null,null,null,null,null,null,0,null,"","","",""]
[null,null,null,null,null,null,null,null,0,null,"","","",""]
[null,null,null,null,null,null,null,null,0,null,"","","",""]
[null,null,null,null,null,null,null,null,0,null,"","","",""]
[null,null,null,null,null,null,null,null,0,null,"","","",""]
[null,null,null,null,null,null,null,null,0,null,"","","",""]
[null,null,null,null,null,null,null,null,0,null,"","","",""]
[null,null,null,null,null,null,null,null,0,null,"","","",""]
[null,null,null,null,null,null,null,null,0,null,"","","",""]
[null,null,null,null,null,null,null,null,0,null,"","","",""]
[null,null,null,null,null,null,null,null,0,null,"","","",""]
[null,null,null,null,null,null,null,null,{"$f":"IFERROR(G266+H266,\"\")","v":0},null,{"$f":"IFERROR(IF(J266<>\"\",F266*J266,\"\"),\"\")","v":""},{"$f":"IFERROR(IF(J266<>\"\",G266*J266,\"\"),\"\")","v":""},{"$f":"IFERROR(IF(J266<>\"\",H266*J266,\"\"),\"\")","v":""},{"$f":"IFERROR(L266+M266,\"\")","v":""}]
[null,null,null,null,null,null,null,null,0,null,"","","",""]
[null,null,null,null,null,null,null,null,0,null,"","","",""]
[null,null,null,null,null,null,null,null,0,null,"","","",""]
[null,null,null,null,null,null,null,null,0,null,"","","",""]
[null,null,null,null,null,null,null,null,0,null,"","","",""]
[null,null,null,null,null,null,null,null,0,null,"","","",""]
[null,null,null,null,null,null,null,null,0,null,"","","",""]
[null,null,null,null,null,null,null,null,0,null,"","","",""]
[null,null,null,null,null,null,null,null,0,null,"","","",""]
[null,null,null,null,null,null,null,null,0,null,"","","",""]
[null,null,null,null,null,null,null,null,0,null,"","","",""]
[null,null,null,null,null,null,null,null,0,null,"","","",""]
[null,null,null,null,null,null,null,null,0,null,"","","",""]
[null,null,null,null,null,null,null,null,0,null,"","","",""]
[null,null,null,null,null,null,null,null,0,null,"","","",""]
[null,null,null,null,null,null,null,null,0,null,"","","",""]
[null,null,null,null,null,null,null,null,0,null,"","","",""]
[null,null,null,null,null,null,null,null,0,null,"","","",""]
[null,null,null,null,null,null,null,null,0,null,"","","",""]
[null,null,null,null,null,null,null,null,0,null,"","","",""]
[null,null,null,null,null,null,null,null,0,null,"","","",""]
[null,null,null,null,null,null,null,null,0,null,"","","",""]
[null,null,null,null,null,null,null,null,0,null,"","","",""]
[null,null,null,null,null,null,null,null,0,null,"","","",""]
[null,null,null,null,null,null,null,null,0,null,"","","",""]
[null,null,null,null,null,null,null,null,0,null,"","","",""]
[null,null,null,null,null,null,null,null,0,null,"","","",""]
[null,null,null,null,null,null,null,null,0,null,"","","",""]
[null,null,null,null,null,null,null,null,0,null,"","","",""]
[null,null,null,null,null,null,null,null,0,null,"","","",""]
[null,null,null,null,null,null,null,null,0,null,"","","",""]
[null,null,null,null,null,null,null,null,0,null,"","","",""]
[null,null,null,null,null,null,null,null,0,null,"","","",""]
[null,null,null,null,null,null,null,null,0,null,"","","",""]
[null,null,null,null,null,null,null,null,0,null,"","","",""]
[null,null,null,null,null,null,null,null,0,null,"","","",""]
[null,null,null,null,null,null,null,null,0,null,"","","",""]
[null,null,null,null,null,null,null,null,0,null,"","","",""]
[null,null,null,null,null,null,null,null,0,null,"","","",""]
[null,null,null,null,null,null,null,null,0,null,"","","",""]
[null,null,null,null,null,null,null,null,0,null,"","","",""]
[null,null,null,null,null,null,null,null,0,null,"","","",""]
[null,null,null,null,null,null,null,null,0,null,"","","",""]
[null,null,null,null,null,null,null,null,0,null,"","","",""]
[null,null,null,null,null,null,null,null,0,null,"","","",""]
[null,null,null,null,null,null,null,null,0,null,"","","",""]
[null,null,null,null,null,null,null,null,0,null,"","","",""]
[null,null,null,null,null,null,null,null,0,null,"","","",""]
[null,null,null,null,null,null,null,null,0,null,"","","",""]
[null,null,null,null,null,null,null,null,0,null,"","","",""]
[null,null,null,null,null,null,null,null,0,null,"","","",""]
[null,null,null,null,null,null,null,null,0,null,"","","",""]
[null,null,null,null,null,null,null,null,0,null,"","","",""]
[null,null,null,null,null,null,null,null,0,null,"","","",""]
[null,null,null,null,null,null,null,null,0,null,"","","",""]
[null,null,null,null,null,null,null,null,0,null,"","","",""]
[null,null,null,null,null,null,null,null,0,null,"","","",""]
[null,null,null,null,null,null,null,null,0,null,"","","",""]
[null,null,null,null,null,null,null,null,0,null,"","","",""]
[null,null,null,null,null,null,null,null,0,null,"","","",""]
[null,null,null,null,null,null,null,null,0,null,"","","",""]
[null,null,null,null,null,null,null,null,0,null,"","","",""]
[null,null,null,null,null,null,null,null,0,null,"","","",""]
[null,null,null,null,null,null,null,null,{"$f":"IFERROR(G330+H330,\"\")","v":0},null,{"$f":"IFERROR(IF(J330<>\"\",F330*J330,\"\"),\"\")","v":""},{"$f":"IFERROR(IF(J330<>\"\",G330*J330,\"\"),\"\")","v":""},{"$f":"IFERROR(IF(J330<>\"\",H330*J330,\"\"),\"\")","v":""},{"$f":"IFERROR(L330+M330,\"\")","v":""}]
[null,null,null,null,null,null,null,null,0,null,"","","",""]
[null,null,null,null,null,null,null,null,0,null,"","","",""]
[null,null,null,null,null,null,null,null,0,null,"","","",""]
[null,null,null,null,null,null,null,null,0,null,"","","",""]
[null,null,null,null,null,null,null,null,0,null,"","","",""]
[null,null,null,null,null,null,null,null,0,null,"","","",""]
[null,null,null,null,null,null,null,null,0,null,"","","",""]
[null,null,null,null,null,null,null,null,0,null,"","","",""]
[null,null,null,null,null,null,null,null,0,null,"","","",""]
[null,null,null,null,null,null,null,null,0,null,"","","",""]
[null,null,null,null,null,null,null,null,0,null,"","","",""]
[null,null,null,null,null,null,null,null,0,null,"","","",""]
[null,null,null,null,null,null,null,null,0,null,"","","",""]
[null,null,null,null,null,null,null,null,0,null,"","","",""]
[null,null,null,null,null,null,null,null,0,null,"","","",""]
[null,null,null,null,null,null,null,null,0,null,"","","",""]
[null,null,null,null,null,null,null,null,0,null,"","","",""]
[null,null,null,null,null,null,null,null,0,null,"","","",""]
[null,null,null,null,null,null,null,null,0,null,"","","",""]
[null,null,null,null,null,null,null,null,0,null,"","","",""]
[null,null,null,null,null,null,null,null,0,null,"","","",""]
[null,null,null,null,null,null,null,null,0,null,"","","",""]
[null,null,null,null,null,null,null,null,0,null,"","","",""]
[null,null,null,null,null,null,null,null,0,null,"","","",""]
[null,null,null,null,null,null,null,null,0,null,"","","",""]
[null,null,null,null,null,null,null,null,0,null,"","","",""]
[null,null,null,null,null,null,null,null,0,null,"","","",""]
[null,null,null,null,null,null,null,null,0,null,"","","",""]
[null,null,null,null,null,null,null,null,0,null,"","","",""]
[null,null,null,null,null,null,null,null,0,null,"","","",""]
[null,null,null,null,null,null,null,null,0,null,"","","",""]
[null,null,null,null,null,null,null,null,0,null,"","","",""]
[null,null,null,null,null,null,null,null,0,null,"","","",""]
[null,null,null,null,null,null,null,null,0,null,"","","",""]
[null,null,null,null,null,null,null,null,0,null,"","","",""]
[null,null,null,null,null,null,null,null,0,null,"","","",""]
[null,null,null,null,null,null,null,null,0,null,"","","",""]
[null,null,null,null,null,null,null,null,0,null,"","","",""]
[null,null,null,null,null,null,null,null,0,null,"","","",""]
[null,null,null,null,null,null,null,null,0,null,"","","",""]
[null,null,null,null,null,null,null,null,0,null,"","","",""]
[null,null,null,null,null,null,null,null,0,null,"","","",""]
[null,null,null,null,null,null,null,null,0,null,"","","",""]
[null,null,null,null,null,null,null,null,0,null,"","","",""]
[null,null,null,null,null,null,null,null,0,null,"","","",""]
[null,null,null,null,null,null,null,null,0,null,"","","",""]
[null,null,null,null,null,null,null,null,0,null,"","","",""]
[null,null,null,null,null,null,null,null,0,null,"","","",""]
[null,null,null,null,null,null,null,null,0,null,"","","",""]
[null,null,null,null,null,null,null,null,0,null,"","","",""]
[null,null,null,null,null,null,null,null,0,null,"","","",""]
[null,null,null,null,null,null,null,null,0,null,"","","",""]
[null,null,null,null,null,null,null,null,0,null,"","","",""]
[null,null,null,null,null,null,null,null,0,null,"","","",""]
[null,null,null,null,null,null,null,null,0,null,"","","",""]
[null,null,null,null,null,null,null,null,0,null,"","","",""]
[null,null,null,null,null,null,null,null,0,null,"","","",""]
[null,null,null,null,null,null,null,null,0,null,"","","",""]
[null,null,null,null,null,null,null,null,0,null,"","","",""]
[null,null,null,null,null,null,null,null,0,null,"","","",""]
[null,null,null,null,null,null,null,null,0,null,"","","",""]
[null,null,null,null,null,null,null,null,0,null,"","","",""]
[null,null,null,null,null,null,null,null,0,null,"","","",""]
[null,null,null,null,null,null,null,null,{"$f":"IFERROR(G394+H394,\"\")","v":0},null,{"$f":"IFERROR(IF(J394<>\"\",F394*J394,\"\"),\"\")","v":""},{"$f":"IFERROR(IF(J394<>\"\",G394*J394,\"\"),\"\")","v":""},{"$f":"IFERROR(IF(J394<>\"\",H394*J394,\"\"),\"\")","v":""},{"$f":"IFERROR(L394+M394,\"\")","v":""}]
[null,null,null,null,null,null,null,null,0,null,"","","",""]
[null,null,null,null,null,null,null,null,0,null,"","","",""]
[null,null,null,null,null,null,null,null,0,null,"","","",""]
[null,null,null,null,null,null,null,null,0,null,"","","",""]
[null,null,null,null,null,null,null,null,0,null,"","","",""]
[null,null,null,null,null,null,null,null,0,null,"","","",""]
[null,null,null,null,null,null,null,null,0,null,"","","",""]
[null,null,null,null,null,null,null,null,0,null,"","","",""]
[null,null,null,null,null,null,null,null,0,null,"","","",""]
[null,null,null,null,null,null,null,null,0,null,"","","",""]
[null,null,null,null,null,null,null,null,0,null,"","","",""]
[null,null,null,null,null,null,null,null,0,null,"","","",""]
[null,null,null,null,null,null,null,null,0,null,"","","",""]
[null,null,null,null,null,null,null,null,0,null,"","","",""]
[null,null,null,null,null,null,null,null,0,null,"","","",""]
[null,null,null,null,null,null,null,null,0,null,"","","",""]
[null,null,null,null,null,null,null,null,0,null,"","","",""]
[null,null,null,null,null,null,null,null,0,null,"","","",""]
[null,null,null,null,null,null,null,null,0,null,"","","",""]
[null,null,null,null,null,null,null,null,0,null,"","","",""]
[null,null,null,null,null,null,null,null,0,null,"","","",""]
[null,null,null,null,null,null,null,null,0,null,"","","",""]
[null,null,null,null,null,null,null,null,0,null,"","","",""]
[null,null,null,null,null,null,null,null,0,null,"","","",""]
[null,null,null,null,null,null,null,null,0,null,"","","",""]
[null,null,null,null,null,null,null,null,0,null,"","","",""]
[null,null,null,null,null,null,null,null,0,null,"","","",""]
[null,null,null,null,null,null,null,null,0,null,"","","",""]
[null,null,null,null,null,null,null,null,0,null,"","","",""]
[null,null,null,null,null,null,null,null,0,null,"","","",""]
[null,null,null,null,null,null,null,null,0,null,"","","",""]
[null,null,null,null,null,null,null,null,0,null,"","","",""]
[null,null,null,null,null,null,null,null,0,null,"","","",""]
[null,null,null,null,null,null,null,null,0,null,"","","",""]
[null,null,null,null,null,null,null,null,0,null,"","","",""]
[null,null,null,null,null,null,null,null,0,null,"","","",""]
[null,null,null,null,null,null,null,null,0,null,"","","",""]
[null,null,null,null,null,null,null,null,0,null,"","","",""]
[null,null,null,null,null,null,null,null,0,null,"","","",""]
[null,null,null,null,null,null,null,null,0,null,"","","",""]
[null,null,null,null,null,null,null,null,0,null,"","","",""]
[null,null,null,null,null,null,null,null,0,null,"","","",""]
[null,null,null,null,null,null,null,null,0,null,"","","",""]
[null,null,null,null,null,null,null,null,0,null,"","","",""]
[null,null,null,null,null,null,null,null,0,null,"","","",""]
[null,null,null,null,null,null,null,null,0,null,"","","",""]
[null,null,null,null,null,null,null,null,0,null,"","","",""]
[null,null,null,null,null,null,null,null,0,null,"","","",""]
[null,null,null,null,null,null,null,null,0,null,"","","",""]
[null,null,null,null,null,null,null,null,0,null,"","","",""]
[null,null,null,null,null,null,null,null,0,null,"","","",""]
[null,null,null,null,null,null,null,null,0,null,"","","",""]
[null,null,null,null,null,null,null,null,0,null,"","","",""]
[null,null,null,null,null,null,null,null,0,null,"","","",""]
[null,null,null,null,null,null,null,null,0,null,"","","",""]
[null,null,null,null,null,null,null,null,0,null,"","","",""]
[null,null,null,null,null,null,null,null,0,null,"","","",""]
[null,null,null,null,null,null,null,null,0,null,"","","",""]
[null,null,null,null,null,null,null,null,0,null,"","","",""]
[null,null,null,null,null,null,null,null,0,null,"","","",""]
[null,null,null,null,null,null,null,null,0,null,"","","",""]
[null,null,null,null,null,null,null,null,0,null,"","","",""]
[null,null,null,null,null,null,null,null,0,null,"","","",""]
[null,null,null,null,null,null,null,null,{"$f":"IFERROR(G458+H458,\"\")","v":0},null,{"$f":"IFERROR(IF(J458<>\"\",F458*J458,\"\"),\"\")","v":""},{"$f":"IFERROR(IF(J458<>\"\",G458*J458,\"\"),\"\")","v":""},{"$f":"IFERROR(IF(J458<>\"\",H458*J458,\"\"),\"\")","v":""},{"$f":"IFERROR(L458+M458,\"\")","v":""}]
[null,null,null,null,null,null,null,null,0,null,"","","",""]
[null,null,null,null,null,null,null,null,0,null,"","","",""]
[null,null,null,null,null,null,null,null,0,null,"","","",""]
[null,null,null,null,null,null,null,null,0,null,"","","",""]
[null,null,null,null,null,null,null,null,0,null,"","","",""]
[null,null,null,null,null,null,null,null,0,null,"","","",""]
[null,null,null,null,null,null,null,null,0,null,"","","",""]
[null,null,null,null,null,null,null,null,0,null,"","","",""]
[null,null,null,null,null,null,null,null,0,null,"","","",""]
[null,null,null,null,null,null,null,null,0,null,"","","",""]
[null,null,null,null,null,null,null,null,0,null,"","","",""]
[null,null,null,null,null,null,null,null,0,null,"","","",""]
[null,null,null,null,null,null,null,null,0,null,"","","",""]
[null,null,null,null,null,null,null,null,0,null,"","","",""]
[null,null,null,null,null,null,null,null,0,null,"","","",""]
[null,null,null,null,null,null,null,null,0,null,"","","",""]
[null,null,null,null,null,null,null,null,0,null,"","","",""]
[null,null,null,null,null,null,null,null,0,null,"","","",""]
[null,null,null,null,null,null,null,null,0,null,"","","",""]
[null,null,null,null,null,null,null,null,0,null,"","","",""]
[null,null,null,null,null,null,null,null,0,null,"","","",""]
[null,null,null,null,null,null,null,null,0,null,"","","",""]
[null,null,null,null,null,null,null,null,0,null,"","","",""]
[null,null,null,null,null,null,null,null,0,null,"","","",""]
[null,null,null,null,null,null,null,null,0,null,"","","",""]
[null,null,null,null,null,null,null,null,0,null,"","","",""]
[null,null,null,null,null,null,null,null,0,null,"","","",""]
[null,null,null,null,null,null,null,null,0,null,"","","",""]
[null,null,null,null,null,null,null,null,0,null,"","","",""]
[null,null,null,null,null,null,null,null,0,null,"","","",""]
[null,null,null,null,null,null,null,null,0,null,"","","",""]
[null,null,null,null,null,null,null,null,0,null,"","","",""]
[null,null,null,null,null,null,null,null,0,null,"","","",""]
[null,null,null,null,null,null,null,null,0,null,"","","",""]
[null,null,null,null,null,null,null,null,0,null,"","","",""]
[null,null,null,null,null,null,null,null,0,null,"","","",""]
[null,null,null,null,null,null,null,null,0,null,"","","",""]
[null,null,null,null,null,null,null,null,0,null,"","","",""]
[null,null,null,null,null,null,null,null,0,null,"","","",""]
[null,null,null,null,null,null,null,null,0,null,"","","",""]
[null,null,null,null,null,null,null,null,0,null,"","","",""]
[null,null,null,null,null,null,null,null,0,null,"","","",""]
[null,null,null,null,null,null,null,null,0,null,"","","",""]
[null,null,null,null,null,null,null,null,0,null,"","","",""]
[null,null,null,null,null,null,null,null,0,null,"","","",""]
[null,null,null,null,null,null,null,null,0,null,"","","",""]
[null,null,null,null,null,null,null,null,0,null,"","","",""]
[null,null,null,null,null,null,null,null,0,null,"","","",""]
[null,null,null,null,null,null,null,null,0,null,"","","",""]
[null,null,null,null,null,null,null,null,0,null,"","","",""]
[null,null,null,null,null,null,null,null,0,null,"","","",""]
[null,null,null,null,null,null,null,null,0,null,"","","",""]
[null,null,null,null,null,null,null,null,0,null,"","","",""]
[null,null,null,null,null,null,null,null,0,null,"","","",""]
[null,null,null,null,null,null,null,null,0,null,"","","",""]
[null,null,null,null,null,null,null,null,0,null,"","","",""]
[null,null,null,null,null,null,null,null,0,null,"","","",""]
[null,null,null,null,null,null,null,null,0,null,"","","",""]
[null,null,null,null,null,null,null,null,0,null,"","","",""]
[null,null,null,null,null,null,null,null,0,null,"","","",""]
[null,null,null,null,null,null,null,null,0,null,"","","",""]
[null,null,null,null,null,null,null,null,0,null,"","","",""]
[null,null,null,null,null,null,null,null,0,null,"","","",""]
[null,null,null,null,null,null,null,null,{"$f":"IFERROR(G522+H522,\"\")","v":0},null,{"$f":"IFERROR(IF(J522<>\"\",F522*J522,\"\"),\"\")","v":""},{"$f":"IFERROR(IF(J522<>\"\",G522*J522,\"\"),\"\")","v":""},{"$f":"IFERROR(IF(J522<>\"\",H522*J522,\"\"),\"\")","v":""},{"$f":"IFERROR(L522+M522,\"\")","v":""}]
[null,null,null,null,null,null,null,null,0,null,"","","",""]
[null,null,null,null,null,null,null,null,0,null,"","","",""]
[null,null,null,null,null,null,null,null,0,null,"","","",""]
[null,null,null,null,null,null,null,null,0,null,"","","",""]
[null,null,null,null,null,null,null,null,0,null,"","","",""]
[null,null,null,null,null,null,null,null,0,null,"","","",""]
[null,null,null,null,null,null,null,null,0,null,"","","",""]
[null,null,null,null,null,null,null,null,0,null,"","","",""]
[null,null,null,null,null,null,null,null,0,null,"","","",""]
[null,null,null,null,null,null,null,null,0,null,"","","",""]
[null,null,null,null,null,null,null,null,0,null,"","","",""]
[null,null,null,null,null,null,null,null,0,null,"","","",""]
[null,null,null,null,null,null,null,null,0,null,"","","",""]
[null,null,null,null,null,null,null,null,0,null,"","","",""]
[null,null,null,null,null,null,null,null,0,null,"","","",""]
[null,null,null,null,null,null,null,null,0,null,"","","",""]
[null,null,null,null,null,null,null,null,0,null,"","","",""]
[null,null,null,null,null,null,null,null,0,null,"","","",""]
[null,null,null,null,null,null,null,null,0,null,"","","",""]
[null,null,null,null,null,null,null,null,0,null,"","","",""]
[null,null,null,null,null,null,null,null,0,null,"","","",""]
[null,null,null,null,null,null,null,null,0,null,"","","",""]
[null,null,null,null,null,null,null,null,0,null,"","","",""]
[null,null,null,null,null,null,null,null,0,null,"","","",""]
[null,null,null,null,null,null,null,null,0,null,"","","",""]
[null,null,null,null,null,null,null,null,0,null,"","","",""]
[null,null,null,null,null,null,null,null,0,null,"","","",""]
[null,null,null,null,null,null,null,null,0,null,"","","",""]
[null,null,null,null,null,null,null,null,0,null,"","","",""]
[null,null,null,null,null,null,null,null,0,null,"","","",""]
[null,null,null,null,null,null,null,null,0,null,"","","",""]
[null,null,null,null,null,null,null,null,0,null,"","","",""]
[null,null,null,null,null,null,null,null,0,null,"","","",""]
[null,null,null,null,null,null,null,null,0,null,"","","",""]
[null,null,null,null,null,null,null,null,0,null,"","","",""]
[null,null,null,null,null,null,null,null,0,null,"","","",""]
[null,null,null,null,null,null,null,null,0,null,"","","",""]
[null,null,null,null,null,null,null,null,0,null,"","","",""]
[null,null,null,null,null,null,null,null,0,null,"","","",""]
[null,null,null,null,null,null,null,null,0,null,"","","",""]
[null,null,null,null,null,null,null,null,0,null,"","","",""]
[null,null,null,null,null,null,null,null,0,null,"","","",""]
[null,null,null,null,null,null,null,null,0,null,"","","",""]
[null,null,null,null,null,null,null,null,0,null,"","","",""]
[null,null,null,null,null,null,null,null,0,null,"","","",""]
[null,null,null,null,null,null,null,null,0,null,"","","",""]
[null,null,null,null,null,null,null,null,0,null,"","","",""]
[null,null,null,null,null,null,null,null,0,null,"","","",""]
[null,null,null,null,null,null,null,null,0,null,"","","",""]
[null,null,null,null,null,null,null,null,0,null,"","","",""]
[null,null,null,null,null,null,null,null,0,null,"","","",""]
[null,null,null,null,null,null,null,null,0,null,"","","",""]
[null,null,null,null,null,null,null,null,0,null,"","","",""]
[null,null,null,null,null,null,null,null,0,null,"","","",""]
[null,null,null,null,null,null,null,null,0,null,"","","",""]
[null,null,null,null,null,null,null,null,0,null,"","","",""]
[null,null,null,null,null,null,null,null,0,null,"","","",""]
[null,null,null,null,null,null,null,null,0,null,"","","",""]
[null,null,null,null,null,null,null,null,0,null,"","","",""]
[null,null,null,null,null,null,null,null,0,null,"","","",""]
[null,null,null,null,null,null,null,null,0,null,"","","",""]
[null,null,null,null,null,null,null,null,0,null,"","","",""]
[null,null,null,null,null,null,null,null,0,null,"","","",""]
[null,null,null,null,null,null,null,null,{"$f":"IFERROR(G586+H586,\"\")","v":0},null,{"$f":"IFERROR(IF(J586<>\"\",F586*J586,\"\"),\"\")","v":""},{"$f":"IFERROR(IF(J586<>\"\",G586*J586,\"\"),\"\")","v":""},{"$f":"IFERROR(IF(J586<>\"\",H586*J586,\"\"),\"\")","v":""},{"$f":"IFERROR(L586+M586,\"\")","v":""}]
[null,null,null,null,null,null,null,null,0,null,"","","",""]
[null,null,null,null,null,null,null,null,0,null,"","","",""]
[null,null,null,null,null,null,null,null,0,null,"","","",""]
[null,null,null,null,null,null,null,null,0,null,"","","",""]
[null,null,null,null,null,null,null,null,0,null,"","","",""]
[null,null,null,null,null,null,null,null,0,null,"","","",""]
[null,null,null,null,null,null,null,null,0,null,"","","",""]
[null,null,null,null,null,null,null,null,0,null,"","","",""]
[null,null,null,null,null,null,null,null,0,null,"","","",""]
[null,null,null,null,null,null,null,null,0,null,"","","",""]
[null,null,null,null,null,null,null,null,0,null,"","","",""]
[null,null,null,null,null,null,null,null,0,null,"","","",""]
[null,null,null,null,null,null,null,null,0,null,"","","",""]
[null,null,null,null,null,null,null,null,0,null,"","","",""]
[null,null,null,null,null,null,null,null,0,null,"","","",""]
[null,null,null,null,null,null,null,null,0,null,"","","",""]
[null,null,null,null,null,null,null,null,0,null,"","","",""]
[null,null,null,null,null,null,null,null,0,null,"","","",""]
[null,null,null,null,null,null,null,null,0,null,"","","",""]
[null,null,null,null,null,null,null,null,0,null,"","","",""]
[null,null,null,null,null,null,null,null,0,null,"","","",""]
[null,null,null,null,null,null,null,null,0,null,"","","",""]
[null,null,null,null,null,null,null,null,0,null,"","","",""]
[null,null,null,null,null,null,null,null,0,null,"","","",""]
[null,null,null,null,null,null,null,null,0,null,"","","",""]
[null,null,null,null,null,null,null,null,0,null,"","","",""]
[null,null,null,null,null,null,null,null,0,null,"","","",""]
[null,null,null,null,null,null,null,null,0,null,"","","",""]
[null,null,null,null,null,null,null,null,0,null,"","","",""]
[null,null,null,null,null,null,null,null,0,null,"","","",""]
[null,null,null,null,null,null,null,null,0,null,"","","",""]
[null,null,null,null,null,null,null,null,0,null,"","","",""]
[null,null,null,null,null,null,null,null,0,null,"","","",""]
[null,null,null,null,null,null,null,null,0,null,"","","",""]
[null,null,null,null,null,null,null,null,0,null,"","","",""]
[null,null,null,null,null,null,null,null,0,null,"","","",""]
[null,null,null,null,null,null,null,null,0,null,"","","",""]
[null,null,null,null,null,null,null,null,0,null,"","","",""]
[null,null,null,null,null,null,null,null,0,null,"","","",""]
[null,null,null,null,null,null,null,null,0,null,"","","",""]
[null,null,null,null,null,null,null,null,0,null,"","","",""]
[null,null,null,null,null,null,null,null,0,null,"","","",""]
[null,null,null,null,null,null,null,null,0,null,"","","",""]
[null,null,null,null,null,null,null,null,0,null,"","","",""]
[null,null,null,null,null,null,null,null,0,null,"","","",""]
[null,null,null,null,null,null,null,null,0,null,"","","",""]
[null,null,null,null,null,null,null,null,0,null,"","","",""]
[null,null,null,null,null,null,null,null,0,null,"","","",""]
[null,null,null,null,null,null,null,null,0,null,"","","",""]
[null,null,null,null,null,null,null,null,0,null,"","","",""]
[null,null,null,null,null,null,null,null,0,null,"","","",""]
[null,null,null,null,null,null,null,null,0,null,"","","",""]
[null,null,null,null,null,null,null,null,0,null,"","","",""]
[null,null,null,null,null,null,null,null,0,null,"","","",""]
[null,null,null,null,null,null,null,null,0,null,"","","",""]
[null,null,null,null,null,null,null,null,0,null,"","","",""]
[null,null,null,null,null,null,null,null,0,null,"","","",""]
[null,null,null,null,null,null,null,null,0,null,"","","",""]
[null,null,null,null,null,null,null,null,0,null,"","","",""]
[null,null,null,null,null,null,null,null,0,null,"","","",""]
[null,null,null,null,null,null,null,null,0,null,"","","",""]
[null,null,null,null,null,null,null,null,0,null,"","","",""]
[null,null,null,null,null,null,null,null,0,null,"","","",""]
[null,null,null,null,null,null,null,null,{"$f":"IFERROR(G650+H650,\"\")","v":0},null,{"$f":"IFERROR(IF(J650<>\"\",F650*J650,\"\"),\"\")","v":""},{"$f":"IFERROR(IF(J650<>\"\",G650*J650,\"\"),\"\")","v":""},{"$f":"IFERROR(IF(J650<>\"\",H650*J650,\"\"),\"\")","v":""},{"$f":"IFERROR(L650+M650,\"\")","v":""}]
[null,null,null,null,null,null,null,null,0,null,"","","",""]
[null,null,null,null,null,null,null,null,0,null,"","","",""]
[null,null,null,null,null,null,null,null,0,null,"","","",""]
[null,null,null,null,null,null,null,null,0,null,"","","",""]
[null,null,null,null,null,null,null,null,0,null,"","","",""]
[null,null,null,null,null,null,null,null,0,null,"","","",""]
[null,null,null,null,null,null,null,null,0,null,"","","",""]
[null,null,null,null,null,null,null,null,0,null,"","","",""]
[null,null,null,null,null,null,null,null,0,null,"","","",""]
[null,null,null,null,null,null,null,null,0,null,"","","",""]
[null,null,null,null,null,null,null,null,0,null,"","","",""]
[null,null,null,null,null,null,null,null,0,null,"","","",""]
[null,null,null,null,null,null,null,null,0,null,"","","",""]
[null,null,null,null,null,null,null,null,0,null,"","","",""]
[null,null,null,null,null,null,null,null,0,null,"","","",""]
[null,null,null,null,null,null,null,null,0,null,"","","",""]
[null,null,null,null,null,null,null,null,0,null,"","","",""]
[null,null,null,null,null,null,null,null,0,null,"","","",""]
[null,null,null,null,null,null,null,null,0,null,"","","",""]
[null,null,null,null,null,null,null,null,0,null,"","","",""]
[null,null,null,null,null,null,null,null,0,null,"","","",""]
[null,null,null,null,null,null,null,null,0,null,"","","",""]
[null,null,null,null,null,null,null,null,0,null,"","","",""]
[null,null,null,null,null,null,null,null,0,null,"","","",""]
[null,null,null,null,null,null,null,null,0,null,"","","",""]
[null,null,null,null,null,null,null,null,0,null,"","","",""]
[null,null,null,null,null,null,null,null,0,null,"","","",""]
[null,null,null,null,null,null,null,null,0,null,"","","",""]
[null,null,null,null,null,null,null,null,0,null,"","","",""]
[null,null,null,null,null,null,null,null,0,null,"","","",""]
[null,null,null,null,null,null,null,null,0,null,"","","",""]
[null,null,null,null,null,null,null,null,0,null,"","","",""]
[null,null,null,null,null,null,null,null,0,null,"","","",""]
[null,null,null,null,null,null,null,null,0,null,"","","",""]
[null,null,null,null,null,null,null,null,0,null,"","","",""]
[null,null,null,null,null,null,null,null,0,null,"","","",""]
[null,null,null,null,null,null,null,null,0,null,"","","",""]
[null,null,null,null,null,null,null,null,0,null,"","","",""]
[null,null,null,null,null,null,null,null,0,null,"","","",""]
[null,null,null,null,null,null,null,null,0,null,"","","",""]
[null,null,null,null,null,null,null,null,0,null,"","","",""]
[null,null,null,null,null,null,null,null,0,null,"","","",""]
[null,null,null,null,null,null,null,null,0,null,"","","",""]
[null,null,null,null,null,null,null,null,0,null,"","","",""]
[null,null,null,null,null,null,null,null,0,null,"","","",""]
[null,null,null,null,null,null,null,null,0,null,"","","",""]
[null,null,null,null,null,null,null,null,0,null,"","","",""]
[null,null,null,null,null,null,null,null,0,null,"","","",""]
[null,null,null,null,null,null,null,null,0,null,"","","",""]
[null,null,null,null,null,null,null,null,0,null,"","","",""]
[null,null,null,null,null,null,null,null,0,null,"","","",""]
[null,null,null,null,null,null,null,null,0,null,"","","",""]
[null,null,null,null,null,null,null,null,0,null,"","","",""]
[null,null,null,null,null,null,null,null,0,null,"","","",""]
[null,null,null,null,null,null,null,null,0,null,"","","",""]
[null,null,null,null,null,null,null,null,0,null,"","","",""]
[null,null,null,null,null,null,null,null,0,null,"","","",""]
[null,null,null,null,null,null,null,null,0,null,"","","",""]
[null,null,null,null,null,null,null,null,0,null,"","","",""]
[null,null,null,null,null,null,null,null,0,null,"","","",""]
[null,null,null,null,null,null,null,null,0,null,"","","",""]
[null,null,null,null,null,null,null,null,0,null,"","","",""]
[null,null,null,null,null,null,null,null,0,null,"","","",""]
[null,null,null,null,null,null,null,null,{"$f":"IFERROR(G714+H714,\"\")","v":0},null,{"$f":"IFERROR(IF(J714<>\"\",F714*J714,\"\"),\"\")","v":""},{"$f":"IFERROR(IF(J714<>\"\",G714*J714,\"\"),\"\")","v":""},{"$f":"IFERROR(IF(J714<>\"\",H714*J714,\"\"),\"\")","v":""},{"$f":"IFERROR(L714+M714,\"\")","v":""}]
[null,null,null,null,null,null,null,null,0,null,"","","",""]
[null,null,null,null,null,null,null,null,0,null,"","","",""]
[null,null,null,null,null,null,null,null,0,null,"","","",""]
[null,null,null,null,null,null,null,null,0,null,"","","",""]
[null,null,null,null,null,null,null,null,0,null,"","","",""]
[null,null,null,null,null,null,null,null,0,null,"","","",""]
[null,null,null,null,null,null,null,null,0,null,"","","",""]
[null,null,null,null,null,null,null,null,0,null,"","","",""]
[null,null,null,null,null,null,null,null,0,null,"","","",""]
[null,null,null,null,null,null,null,null,0,null,"","","",""]
[null,null,null,null,null,null,null,null,0,null,"","","",""]
[null,null,null,null,null,null,null,null,0,null,"","","",""]
[null,null,null,null,null,null,null,null,0,null,"","","",""]
[null,null,null,null,null,null,null,null,0,null,"","","",""]
[null,null,null,null,null,null,null,null,0,null,"","","",""]
[null,null,null,null,null,null,null,null,0,null,"","","",""]
[null,null,null,null,null,null,null,null,0,null,"","","",""]
[null,null,null,null,null,null,null,null,0,null,"","","",""]
[null,null,null,null,null,null,null,null,0,null,"","","",""]
[null,null,null,null,null,null,null,null,0,null,"","","",""]
[null,null,null,null,null,null,null,null,0,null,"","","",""]
[null,null,null,null,null,null,null,null,0,null,"","","",""]
[null,null,null,null,null,null,null,null,0,null,"","","",""]
[null,null,null,null,null,null,null,null,0,null,"","","",""]
[null,null,null,null,null,null,null,null,0,null,"","","",""]
[null,null,null,null,null,null,null,null,0,null,"","","",""]
[null,null,null,null,null,null,null,null,0,null,"","","",""]
[null,null,null,null,null,null,null,null,0,null,"","","",""]
[null,null,null,null,null,null,null,null,0,null,"","","",""]
[null,null,null,null,null,null,null,null,0,null,"","","",""]
[null,null,null,null,null,null,null,null,0,null,"","","",""]
[null,null,null,null,null,null,null,null,0,null,"","","",""]
[null,null,null,null,null,null,null,null,0,null,"","","",""]
[null,null,null,null,null,null,null,null,0,null,"","","",""]
[null,null,null,null,null,null,null,null,0,null,"","","",""]
[null,null,null,null,null,null,null,null,0,null,"","","",""]
[null,null,null,null,null,null,null,null,0,null,"","","",""]
[null,null,null,null,null,null,null,null,0,null,"","","",""]
[null,null,null,null,null,null,null,null,0,null,"","","",""]
[null,null,null,null,null,null,null,null,0,null,"","","",""]
[null,null,null,null,null,null,null,null,0,null,"","","",""]
[null,null,null,null,null,null,null,null,0,null,"","","",""]
[null,null,null,null,null,null,null,null,0,null,"","","",""]
[null,null,null,null,null,null,null,null,0,null,"","","",""]
[null,null,null,null,null,null,null,null,0,null,"","","",""]
[null,null,null,null,null,null,null,null,0,null,"","","",""]
[null,null,null,null,null,null,null,null,0,null,"","","",""]
[null,null,null,null,null,null,null,null,0,null,"","","",""]
[null,null,null,null,null,null,null,null,0,null,"","","",""]
[null,null,null,null,null,null,null,null,0,null,"","","",""]
[null,null,null,null,null,null,null,null,0,null,"","","",""]
[null,null,null,null,null,null,null,null,0,null,"","","",""]
[null,null,null,null,null,null,null,null,0,null,"","","",""]
[null,null,null,null,null,null,null,null,0,null,"","","",""]
[null,null,null,null,null,null,null,null,0,null,"","","",""]
[null,null,null,null,null,null,null,null,0,null,"","","",""]
[null,null,null,null,null,null,null,null,0,null,"","","",""]
[null,null,null,null,null,null,null,null,0,null,"","","",""]
[null,null,null,null,null,null,null,null,0,null,"","","",""]
[null,null,null,null,null,null,null,null,0,null,"","","",""]
[null,null,null,null,null,null,null,null,0,null,"","","",""]
[null,null,null,null,null,null,null,null,0,null,"","","",""]
[null,null,null,null,null,null,null,null,0,null,"","","",""]
[null,null,null,null,null,null,null,null,{"$f":"IFERROR(G778+H778,\"\")","v":0},null,{"$f":"IFERROR(IF(J778<>\"\",F778*J778,\"\"),\"\")","v":""},{"$f":"IFERROR(IF(J778<>\"\",G778*J778,\"\"),\"\")","v":""},{"$f":"IFERROR(IF(J778<>\"\",H778*J778,\"\"),\"\")","v":""},{"$f":"IFERROR(L778+M778,\"\")","v":""}]
[null,null,null,null,null,null,null,null,0,null,"","","",""]
[null,null,null,null,null,null,null,null,0,null,"","","",""]
[null,null,null,null,null,null,null,null,0,null,"","","",""]
[null,null,null,null,null,null,null,null,0,null,"","","",""]
[null,null,null,null,null,null,null,null,0,null,"","","",""]
[null,null,null,null,null,null,null,null,0,null,"","","",""]
[null,null,null,null,null,null,null,null,0,null,"","","",""]
[null,null,null,null,null,null,null,null,0,null,"","","",""]
[null,null,null,null,null,null,null,null,0,null,"","","",""]
[null,null,null,null,null,null,null,null,0,null,"","","",""]
[null,null,null,null,null,null,null,null,0,null,"","","",""]
[null,null,null,null,null,null,null,null,0,null,"","","",""]
[null,null,null,null,null,null,null,null,0,null,"","","",""]
[null,null,null,null,null,null,null,null,0,null,"","","",""]
[null,null,null,null,null,null,null,null,0,null,"","","",""]
[null,null,null,null,null,null,null,null,0,null,"","","",""]
[null,null,null,null,null,null,null,null,0,null,"","","",""]
[null,null,null,null,null,null,null,null,0,null,"","","",""]
[null,null,null,null,null,null,null,null,0,null,"","","",""]
[null,null,null,null,null,null,null,null,0,null,"","","",""]
[null,null,null,null,null,null,null,null,0,null,"","","",""]
[null,null,null,null,null,null,null,null,0,null,"","","",""]
[null,null,null,null,null,null,null,null,0,null,"","","",""]
[null,null,null,null,null,null,null,null,0,null,"","","",""]
[null,null,null,null,null,null,null,null,0,null,"","","",""]
[null,null,null,null,null,null,null,null,0,null,"","","",""]
[null,null,null,null,null,null,null,null,0,null,"","","",""]
[null,null,null,null,null,null,null,null,0,null,"","","",""]
[null,null,null,null,null,null,null,null,0,null,"","","",""]
[null,null,null,null,null,null,null,null,0,null,"","","",""]
[null,null,null,null,null,null,null,null,0,null,"","","",""]
[null,null,null,null,null,null,null,null,0,null,"","","",""]
[null,null,null,null,null,null,null,null,0,null,"","","",""]
[null,null,null,null,null,null,null,null,0,null,"","","",""]
[null,null,null,null,null,null,null,null,0,null,"","","",""]
[null,null,null,null,null,null,null,null,0,null,"","","",""]
[null,null,null,null,null,null,null,null,0,null,"","","",""]
[null,null,null,null,null,null,null,null,0,null,"","","",""]
[null,null,null,null,null,null,null,null,0,null,"","","",""]
[null,null,null,null,null,null,null,null,0,null,"","","",""]
[null,null,null,null,null,null,null,null,0,null,"","","",""]
[null,null,null,null,null,null,null,null,0,null,"","","",""]
[null,null,null,null,null,null,null,null,0,null,"","","",""]
[null,null,null,null,null,null,null,null,0,null,"","","",""]
[null,null,null,null,null,null,null,null,0,null,"","","",""]
[null,null,null,null,null,null,null,null,0,null,"","","",""]
[null,null,null,null,null,null,null,null,0,null,"","","",""]
[null,null,null,null,null,null,null,null,0,null,"","","",""]
[null,null,null,null,null,null,null,null,0,null,"","","",""]
[null,null,null,null,null,null,null,null,0,null,"","","",""]
[null,null,null,null,null,null,null,null,0,null,"","","",""]
[null,null,null,null,null,null,null,null,0,null,"","","",""]
[null,null,null,null,null,null,null,null,0,null,"","","",""]
[null,null,null,null,null,null,null,null,0,null,"","","",""]
[null,null,null,null,null,null,null,null,0,null,"","","",""]
[null,null,null,null,null,null,null,null,0,null,"","","",""]
[null,null,null,null,null,null,null,null,0,null,"","","",""]
[null,null,null,null,null,null,null,null,0,null,"","","",""]
[null,null,null,null,null,null,null,null,0,null,"","","",""]
[null,null,null,null,null,null,null,null,0,null,"","","",""]
[null,null,null,null,null,null,null,null,0,null,"","","",""]
[null,null,null,null,null,null,null,null,0,null,"","","",""]
[null,null,null,null,null,null,null,null,0,null,"","","",""]
[null,null,null,null,null,null,null,null,{"$f":"IFERROR(G842+H842,\"\")","v":0},null,{"$f":"IFERROR(IF(J842<>\"\",F842*J842,\"\"),\"\")","v":""},{"$f":"IFERROR(IF(J842<>\"\",G842*J842,\"\"),\"\")","v":""},{"$f":"IFERROR(IF(J842<>\"\",H842*J842,\"\"),\"\")","v":""},{"$f":"IFERROR(L842+M842,\"\")","v":""}]
[null,null,null,null,null,null,null,null,0,null,"","","",""]
[null,null,null,null,null,null,null,null,0,null,"","","",""]
[null,null,null,null,null,null,null,null,0,null,"","","",""]
[null,null,null,null,null,null,null,null,0,null,"","","",""]
[null,null,null,null,null,null,null,null,0,null,"","","",""]
[null,null,null,null,null,null,null,null,0,null,"","","",""]
[null,null,null,null,null,null,null,null,0,null,"","","",""]
[null,null,null,null,null,null,null,null,0,null,"","","",""]
[null,null,null,null,null,null,null,null,0,null,"","","",""]
[null,null,null,null,null,null,null,null,0,null,"","","",""]
[null,null,null,null,null,null,null,null,0,null,"","","",""]
[null,null,null,null,null,null,null,null,0,null,"","","",""]
[null,null,null,null,null,null,null,null,0,null,"","","",""]
[null,null,null,null,null,null,null,null,0,null,"","","",""]
[null,null,null,null,null,null,null,null,0,null,"","","",""]
[null,null,null,null,null,null,null,null,0,null,"","","",""]
[null,null,null,null,null,null,null,null,0,null,"","","",""]
[null,null,null,null,null,null,null,null,0,null,"","","",""]
[null,null,null,null,null,null,null,null,0,null,"","","",""]
[null,null,null,null,null,null,null,null,0,null,"","","",""]
[null,null,null,null,null,null,null,null,0,null,"","","",""]
[null,null,null,null,null,null,null,null,0,null,"","","",""]
[null,null,null,null,null,null,null,null,0,null,"","","",""]
[null,null,null,null,null,null,null,null,0,null,"","","",""]
[null,null,null,null,null,null,null,null,0,null,"","","",""]
[null,null,null,null,null,null,null,null,0,null,"","","",""]
[null,null,null,null,null,null,null,null,0,null,"","","",""]
[null,null,null,null,null,null,null,null,0,null,"","","",""]
[null,null,null,null,null,null,null,null,0,null,"","","",""]
[null,null,null,null,null,null,null,null,0,null,"","","",""]
[null,null,null,null,null,null,null,null,0,null,"","","",""]
[null,null,null,null,null,null,null,null,0,null,"","","",""]
[null,null,null,null,null,null,null,null,0,null,"","","",""]
[null,null,null,null,null,null,null,null,0,null,"","","",""]
[null,null,null,null,null,null,null,null,0,null,"","","",""]
[null,null,null,null,null,null,null,null,0,null,"","","",""]
[null,null,null,null,null,null,null,null,0,null,"","","",""]
[null,null,null,null,null,null,null,null,0,null,"","","",""]
[null,null,null,null,null,null,null,null,0,null,"","","",""]
[null,null,null,null,null,null,null,null,0,null,"","","",""]
[null,null,null,null,null,null,null,null,0,null,"","","",""]
[null,null,null,null,null,null,null,null,0,null,"","","",""]
[null,null,null,null,null,null,null,null,0,null,"","","",""]
[null,null,null,null,null,null,null,null,0,null,"","","",""]
[null,null,null,null,null,null,null,null,0,null,"","","",""]
[null,null,null,null,null,null,null,null,0,null,"","","",""]
[null,null,null,null,null,null,null,null,0,null,"","","",""]
[null,null,null,null,null,null,null,null,0,null,"","","",""]
[null,null,null,null,null,null,null,null,0,null,"","","",""]
[null,null,null,null,null,null,null,null,0,null,"","","",""]
[null,null,null,null,null,null,null,null,0,null,"","","",""]
[null,null,null,null,null,null,null,null,0,null,"","","",""]
[null,null,null,null,null,null,null,null,0,null,"","","",""]
[null,null,null,null,null,null,null,null,0,null,"","","",""]
[null,null,null,null,null,null,null,null,0,null,"","","",""]
[null,null,null,null,null,null,null,null,0,null,"","","",""]
[null,null,null,null,null,null,null,null,0,null,"","","",""]
[null,null,null,null,null,null,null,null,0,null,"","","",""]
[null,null,null,null,null,null,null,null,0,null,"","","",""]
[null,null,null,null,null,null,null,null,0,null,"","","",""]
[null,null,null,null,null,null,null,null,0,null,"","","",""]
[null,null,null,null,null,null,null,null,0,null,"","","",""]
[null,null,null,null,null,null,null,null,0,null,"","","",""]
[null,null,null,null,null,null,null,null,{"$f":"IFERROR(G906+H906,\"\")","v":0},null,{"$f":"IFERROR(IF(J906<>\"\",F906*J906,\"\"),\"\")","v":""},{"$f":"IFERROR(IF(J906<>\"\",G906*J906,\"\"),\"\")","v":""},{"$f":"IFERROR(IF(J906<>\"\",H906*J906,\"\"),\"\")","v":""},{"$f":"IFERROR(L906+M906,\"\")","v":""}]
[null,null,null,null,null,null,null,null,0,null,"","","",""]
[null,null,null,null,null,null,null,null,0,null,"","","",""]
[null,null,null,null,null,null,null,null,0,null,"","","",""]
[null,null,null,null,null,null,null,null,0,null,"","","",""]
[null,null,null,null,null,null,null,null,0,null,"","","",""]
[null,null,null,null,null,null,null,null,0,null,"","","",""]
[null,null,null,null,null,null,null,null,0,null,"","","",""]
[null,null,null,null,null,null,null,null,0,null,"","","",""]
[null,null,null,null,null,null,null,null,0,null,"","","",""]
[null,null,null,null,null,null,null,null,0,null,"","","",""]
[null,null,null,null,null,null,null,null,0,null,"","","",""]
[null,null,null,null,null,null,null,null,0,null,"","","",""]
[null,null,null,null,null,null,null,null,0,null,"","","",""]
[null,null,null,null,null,null,null,null,0,null,"","","",""]
[null,null,null,null,null,null,null,null,0,null,"","","",""]
[null,null,null,null,null,null,null,null,0,null,"","","",""]
[null,null,null,null,null,null,null,null,0,null,"","","",""]
[null,null,null,null,null,null,null,null,0,null,"","","",""]
[null,null,null,null,null,null,null,null,0,null,"","","",""]
[null,null,null,null,null,null,null,null,0,null,"","","",""]
[null,null,null,null,null,null,null,null,0,null,"","","",""]
[null,null,null,null,null,null,null,null,0,null,"","","",""]
[null,null,null,null,null,null,null,null,0,null,"","","",""]
[null,null,null,null,null,null,null,null,0,null,"","","",""]
[null,null,null,null,null,null,null,null,0,null,"","","",""]
[null,null,null,null,null,null,null,null,0,null,"","","",""]
[null,null,null,null,null,null,null,null,0,null,"","","",""]
[null,null,null,null,null,null,null,null,0,null,"","","",""]
[null,null,null,null,null,null,null,null,0,null,"","","",""]
[null,null,null,null,null,null,null,null,0,null,"","","",""]
[null,null,null,null,null,null,null,null,0,null,"","","",""]
[null,null,null,null,null,null,null,null,0,null,"","","",""]
[null,null,null,null,null,null,null,null,0,null,"","","",""]
[null,null,null,null,null,null,null,null,0,null,"","","",""]
[null,null,null,null,null,null,null,null,0,null,"","","",""]
[null,null,null,null,null,null,null,null,0,null,"","","",""]
[null,null,null,null,null,null,null,null,0,null,"","","",""]
[null,null,null,null,null,null,null,null,0,null,"","","",""]
[null,null,null,null,null,null,null,null,0,null,"","","",""]
[null,null,null,null,null,null,null,null,0,null,"","","",""]
[null,null,null,null,null,null,null,null,0,null,"","","",""]
[null,null,null,null,null,null,null,null,0,null,"","","",""]
[null,null,null,null,null,null,null,null,0,null,"","","",""]
[null,null,null,null,null,null,null,null,0,null,"","","",""]
[null,null,null,null,null,null,null,null,0,null,"","","",""]
[null,null,null,null,null,null,null,null,0,null,"","","",""]
[null,null,null,null,null,null,null,null,0,null,"","","",""]
[null,null,null,null,null,null,null,null,0,null,"","","",""]
[null,null,null,null,null,null,null,null,0,null,"","","",""]
[null,null,null,null,null,null,null,null,0,null,"","","",""]
[null,null,null,null,null,null,null,null,0,null,"","","",""]
[null,null,null,null,null,null,null,null,0,null,"","","",""]
[null,null,null,null,null,null,null,null,0,null,"","","",""]
[null,null,null,null,null,null,null,null,0,null,"","","",""]
[null,null,null,null,null,null,null,null,0,null,"","","",""]
[null,null,null,null,null,null,null,null,0,null,"","","",""]
[null,null,null,null,null,null,null,null,0,null,"","","",""]
[null,null,null,null,null,null,null,null,0,null,"","","",""]
[null,null,null,null,null,null,null,null,0,null,"","","",""]
[null,null,null,null,null,null,null,null,0,null,"","","",""]
[null,null,null,null,null,null,null,null,0,null,"","","",""]
[null,null,null,null,null,null,null,null,0,null,"","","",""]
[null,null,null,null,null,null,null,null,0,null,"","","",""]
[null,null,null,null,null,null,null,null,{"$f":"IFERROR(G970+H970,\"\")","v":0},null,{"$f":"IFERROR(IF(J970<>\"\",F970*J970,\"\"),\"\")","v":""},{"$f":"IFERROR(IF(J970<>\"\",G970*J970,\"\"),\"\")","v":""},{"$f":"IFERROR(IF(J970<>\"\",H970*J970,\"\"),\"\")","v":""},{"$f":"IFERROR(L970+M970,\"\")","v":""}]
[null,null,null,null,null,null,null,null,0,null,"","","",""]
[null,null,null,null,null,null,null,null,0,null,"","","",""]
[null,null,null,null,null,null,null,null,0,null,"","","",""]
[null,null,null,null,null,null,null,null,0,null,"","","",""]
[null,null,null,null,null,null,null,null,0,null,"","","",""]
[null,null,null,null,null,null,null,null,0,null,"","","",""]
[null,null,null,null,null,null,null,null,0,null,"","","",""]
[null,null,null,null,null,null,null,null,0,null,"","","",""]
[null,null,null,null,null,null,null,null,0,null,"","","",""]
[null,null,null,null,null,null,null,null,0,null,"","","",""]
[null,null,null,null,null,null,null,null,0,null,"","","",""]
[null,null,null,null,null,null,null,null,0,null,"","","",""]
[null,null,null,null,null,null,null,null,0,null,"","","",""]
[null,null,null,null,null,null,null,null,0,null,"","","",""]
[null,null,null,null,null,null,null,null,0,null,"","","",""]
[null,null,null,null,null,null,null,null,0,null,"","","",""]
[null,null,null,null,null,null,null,null,0,null,"","","",""]
[null,null,null,null,null,null,null,null,0,null,"","","",""]
[null,null,null,null,null,null,null,null,0,null,"","","",""]
[null,null,null,null,null,null,null,null,0,null,"","","",""]
[null,null,null,null,null,null,null,null,0,null,"","","",""]
[null,null,null,null,null,null,null,null,0,null,"","","",""]
[null,null,null,null,null,null,null,null,0,null,"","","",""]
[null,null,null,null,null,null,null,null,0,null,"","","",""]
[null,null,null,null,null,null,null,null,0,null,"","","",""]
[null,null,null,null,null,null,null,null,0,null,"","","",""]
[null,null,null,null,null,null,null,null,0,null,"","","",""]
[null,null,null,null,null,null,null,null,0,null,"","","",""]
[null,null,null,null,null,null,null,null,{"$f":"IFERROR(G999+H999,\"\")","v":0},null,{"$f":"IFERROR(IF(J999<>\"\",F999*J999,\"\"),\"\")","v":""},{"$f":"IFERROR(IF(J999<>\"\",G999*J999,\"\"),\"\")","v":""},{"$f":"IFERROR(IF(J999<>\"\",H999*J999,\"\"),\"\")","v":""},{"$f":"IFERROR(L999+M999,\"\")","v":""}]
[null,null,null,null,null,null,null,null,0,null,"","","",""]
[null,null,null,null,null,null,null,null,0,null,"","","",""]
[null,null,null,null,null,null,null,null,0,null,"","","",""]
[null,null,null,null,null,null,null,null,0,null,"","","",""]
[null,null,null,null,null,null,null,null,0,null,"","","",""]
[null,null,null,null,null,null,null,null,0,null,"","","",""]
[null,null,null,null,null,null,null,null,0,null,"","","",""]
[null,null,null,null,null,null,null,null,0,null,"","","",""]
[null,null,null,null,null,null,null,null,0,null,"","","",""]
[null,null,null,null,null,null,null,null,0,null,"","","",""]
[null,null,null,null,null,null,null,null,0,null,"","","",""]
[null,null,null,null,null,null,null,null,0,null,"","","",""]
[null,null,null,null,null,null,null,null,0,null,"","","",""]
[null,null,null,null,null,null,null,null,0,null,"","","",""]
[null,null,null,null,null,null,null,null,0,null,"","","",""]
[null,null,null,null,null,null,null,null,0,null,"","","",""]
[null,null,null,null,null,null,null,null,0,null,"","","",""]
[null,null,null,null,null,null,null,null,0,null,"","","",""]
[null,null,null,null,null,null,null,null,0,null,"","","",""]
[null,null,null,null,null,null,null,null,0,null,"","","",""]
[null,null,null,null,null,null,null,null,0,null,"","","",""]
[null,null,null,null,null,null,null,null,0,null,"","","",""]
[null,null,null,null,null,null,null,null,0,null,"","","",""]
[null,null,null,null,null,null,null,null,0,null,"","","",""]
[null,null,null,null,null,null,null,null,0,null,"","","",""]
[null,null,null,null,null,null,null,null,0,null,"","","",""]
[null,null,null,null,null,null,null,null,0,null,"","","",""]
[null,null,null,null,null,null,null,null,0,null,"","","",""]
[null,null,null,null,null,null,null,null,0,null,"","","",""]
[null,null,null,null,null,null,null,null,0,null,"","","",""]
[null,null,null,null,null,null,null,null,0,null,"","","",""]
[null,null,null,null,null,null,null,null,0,null,"","","",""]
[null,null,null,null,null,null,null,null,0,null,"","","",""]
[null,null,null,null,null,null,null,null,0,null,"","","",""]
[null,null,null,null,null,null,null,null,0,null,"","","",""]
[null,null,null,null,null,null,null,null,0,null,"","","",""]
[null,null,null,null,null,null,null,null,0,null,"","","",""]
[null,null,null,null,null,null,null,null,0,null,"","","",""]
[null,null,null,null,null,null,null,null,0,null,"","","",""]
[null,null,null,null,null,null,null,null,0,null,"","","",""]
[null,null,null,null,null,null,null,null,0,null,"","","",""]
[null,null,null,null,null,null,null,null,0,null,"","","",""]
[null,null,null,null,null,null,null,null,0,null,"","","",""]
[null,null,null,null,null,null,null,null,0,null,"","","",""]
[null,null,null,null,null,null,null,null,0,null,"","","",""]
[null,null,null,null,null,null,null,null,0,null,"","","",""]
[null,null,null,null,null,null,null,null,0,null,"","","",""]
[null,null,null,null,null,null,null,null,0,null,"","","",""]
[null,null,null,null,null,null,null,null,0,null,"","","",""]
[null,null,null,null,null,null,null,null,0,null,"","","",""]
[null,null,null,null,null,null,null,null,0,null,"","","",""]
[null,null,null,null,null,null,null,null,0,null,"","","",""]
[null,null,null,null,null,null,null,null,0,null,"","","",""]
[null,null,null,null,null,null,null,null,0,null,"","","",""]
[null,null,null,null,null,null,null,null,0,null,"","","",""]
[null,null,null,null,null,null,null,null,0,null,"","","",""]
[null,null,null,null,null,null,null,null,0,null,"","","",""]
[null,null,null,null,null,null,null,null,0,null,"","","",""]
[null,null,null,null,null,null,null,null,0,null,"","","",""]
[null,null,null,null,null,null,null,null,0,null,"","","",""]
[null,null,null,null,null,null,null,null,0,null,"","","",""]
[null,null,null,null,null,null,null,null,0,null,"","","",""]
[null,null,null,null,null,null,null,null,0,null,"","","",""]
[null,null,null,null,null,null,null,null,{"$f":"IFERROR(G1063+H1063,\"\")","v":0},null,{"$f":"IFERROR(IF(J1063<>\"\",F1063*J1063,\"\"),\"\")","v":""},{"$f":"IFERROR(IF(J1063<>\"\",G1063*J1063,\"\"),\"\")","v":""},{"$f":"IFERROR(IF(J1063<>\"\",H1063*J1063,\"\"),\"\")","v":""},{"$f":"IFERROR(L1063+M1063,\"\")","v":""}]
[null,null,null,null,null,null,null,null,0,null,"","","",""]
[null,null,null,null,null,null,null,null,0,null,"","","",""]
[null,null,null,null,null,null,null,null,0,null,"","","",""]
[null,null,null,null,null,null,null,null,0,null,"","","",""]
[null,null,null,null,null,null,null,null,0,null,"","","",""]
[null,null,null,null,null,null,null,null,0,null,"","","",""]
[null,null,null,null,null,null,null,null,0,null,"","","",""]
[null,null,null,null,null,null,null,null,0,null,"","","",""]
[null,null,null,null,null,null,null,null,0,null,"","","",""]
[null,null,null,null,null,null,null,null,0,null,"","","",""]
[null,null,null,null,null,null,null,null,0,null,"","","",""]
[null,null,null,null,null,null,null,null,0,null,"","","",""]
[null,null,null,null,null,null,null,null,0,null,"","","",""]
[null,null,null,null,null,null,null,null,0,null,"","","",""]
[null,null,null,null,null,null,null,null,0,null,"","","",""]
[null,null,null,null,null,null,null,null,0,null,"","","",""]
[null,null,null,null,null,null,null,null,0,null,"","","",""]
[null,null,null,null,null,null,null,null,0,null,"","","",""]
[null,null,null,null,null,null,null,null,0,null,"","","",""]
[null,null,null,null,null,null,null,null,0,null,"","","",""]
[null,null,null,null,null,null,null,null,0,null,"","","",""]
[null,null,null,null,null,null,null,null,0,null,"","","",""]
[null,null,null,null,null,null,null,null,0,null,"","","",""]
[null,null,null,null,null,null,null,null,0,null,"","","",""]
[null,null,null,null,null,null,null,null,0,null,"","","",""]
[null,null,null,null,null,null,null,null,0,null,"","","",""]
[null,null,null,null,null,null,null,null,0,null,"","","",""]
[null,null,null,null,null,null,null,null,0,null,"","","",""]
[null,null,null,null,null,null,null,null,0,null,"","","",""]
[null,null,null,null,null,null,null,null,0,null,"","","",""]
[null,null,null,null,null,null,null,null,0,null,"","","",""]
[null,null,null,null,null,null,null,null,0,null,"","","",""]
[null,null,null,null,null,null,null,null,0,null,"","","",""]
[null,null,null,null,null,null,null,null,0,null,"","","",""]
[null,null,null,null,null,null,null,null,0,null,"","","",""]
[null,null,null,null,null,null,null,null,0,null,"","","",""]
[null,null,null,null,null,null,null,null,0,null,"","","",""]
[null,null,null,null,null,null,null,null,0,null,"","","",""]
[null,null,null,null,null,null,null,null,0,null,"","","",""]
[null,null,null,null,null,null,null,null,0,null,"","","",""]
[null,null,null,null,null,null,null,null,0,null,"","","",""]
[null,null,null,null,null,null,null,null,0,null,"","","",""]
[null,null,null,null,null,null,null,null,0,null,"","","",""]
[null,null,null,null,null,null,null,null,0,null,"","","",""]
[null,null,null,null,null,null,null,null,0,null,"","","",""]
[null,null,null,null,null,null,null,null,0,null,"","","",""]
[null,null,null,null,null,null,null,null,0,null,"","","",""]
[null,null,null,null,null,null,null,null,0,null,"","","",""]
[null,null,null,null,null,null,null,null,0,null,"","","",""]
[null,null,null,null,null,null,null,null,0,null,"","","",""]
[null,null,null,null,null,null,null,null,0,null,"","","",""]
[null,null,null,null,null,null,null,null,0,null,"","","",""]
[null,null,null,null,null,null,null,null,0,null,"","","",""]
[null,null,null,null,null,null,null,null,0,null,"","","",""]
[null,null,null,null,null,null,null,null,0,null,"","","",""]
[null,null,null,null,null,null,null,null,0,null,"","","",""]
[null,null,null,null,null,null,null,null,0,null,"","","",""]
[null,null,null,null,null,null,null,null,0,null,"","","",""]
[null,null,null,null,null,null,null,null,0,null,"","","",""]
[null,null,null,null,null,null,null,null,0,null,"","","",""]
[null,null,null,null,null,null,null,null,0,null,"","","",""]
[null,null,null,null,null,null,null,null,0,null,"","","",""]
[null,null,null,null,null,null,null,null,0,null,"","","",""]
[null,null,null,null,null,null,null,null,{"$f":"IFERROR(G1127+H1127,\"\")","v":0},null,{"$f":"IFERROR(IF(J1127<>\"\",F1127*J1127,\"\"),\"\")","v":""},{"$f":"IFERROR(IF(J1127<>\"\",G1127*J1127,\"\"),\"\")","v":""},{"$f":"IFERROR(IF(J1127<>\"\",H1127*J1127,\"\"),\"\")","v":""},{"$f":"IFERROR(L1127+M1127,\"\")","v":""}]
[null,null,null,null,null,null,null,null,0,null,"","","",""]
[null,null,null,null,null,null,null,null,0,null,"","","",""]
[null,null,null,null,null,null,null,null,0,null,"","","",""]
[null,null,null,null,null,null,null,null,0,null,"","","",""]
[null,null,null,null,null,null,null,null,0,null,"","","",""]
[null,null,null,null,null,null,null,null,0,null,"","","",""]
[null,null,null,null,null,null,null,null,0,null,"","","",""]
[null,null,null,null,null,null,null,null,0,null,"","","",""]
[null,null,null,null,null,null,null,null,0,null,"","","",""]
[null,null,null,null,null,null,null,null,0,null,"","","",""]
[null,null,null,null,null,null,null,null,0,null,"","","",""]
[null,null,null,null,null,null,null,null,0,null,"","","",""]
[null,null,null,null,null,null,null,null,0,null,"","","",""]
[null,null,null,null,null,null,null,null,0,null,"","","",""]
[null,null,null,null,null,null,null,null,0,null,"","","",""]
[null,null,null,null,null,null,null,null,0,null,"","","",""]
[null,null,null,null,null,null,null,null,0,null,"","","",""]
[null,null,null,null,null,null,null,null,0,null,"","","",""]
[null,null,null,null,null,null,null,null,0,null,"","","",""]
[null,null,null,null,null,null,null,null,0,null,"","","",""]
[null,null,null,null,null,null,null,null,0,null,"","","",""]
[null,null,null,null,null,null,null,null,0,null,"","","",""]
[null,null,null,null,null,null,null,null,0,null,"","","",""]
[null,null,null,null,null,null,null,null,0,null,"","","",""]
[null,null,null,null,null,null,null,null,0,null,"","","",""]
[null,null,null,null,null,null,null,null,0,null,"","","",""]
[null,null,null,null,null,null,null,null,0,null,"","","",""]
[null,null,null,null,null,null,null,null,0,null,"","","",""]
[null,null,null,null,null,null,null,null,0,null,"","","",""]
[null,null,null,null,null,null,null,null,0,null,"","","",""]
[null,null,null,null,null,null,null,null,0,null,"","","",""]
[null,null,null,null,null,null,null,null,0,null,"","","",""]
[null,null,null,null,null,null,null,null,0,null,"","","",""]
[null,null,null,null,null,null,null,null,0,null,"","","",""]
[null,null,null,null,null,null,null,null,0,null,"","","",""]
[null,null,null,null,null,null,null,null,0,null,"","","",""]
[null,null,null,null,null,null,null,null,0,null,"","","",""]
[null,null,null,null,null,null,null,null,0,null,"","","",""]
[null,null,null,null,null,null,null,null,0,null,"","","",""]
[null,null,null,null,null,null,null,null,0,null,"","","",""]
[null,null,null,null,null,null,null,null,0,null,"","","",""]
[null,null,null,null,null,null,null,null,0,null,"","","",""]
[null,null,null,null,null,null,null,null,0,null,"","","",""]
[null,null,null,null,null,null,null,null,0,null,"","","",""]
[null,null,null,null,null,null,null,null,0,null,"","","",""]
[null,null,null,null,null,null,null,null,0,null,"","","",""]
[null,null,null,null,null,null,null,null,0,null,"","","",""]
[null,null,null,null,null,null,null,null,0,null,"","","",""]
[null,null,null,null,null,null,null,null,0,null,"","","",""]
[null,null,null,null,null,null,null,null,0,null,"","","",""]
[null,null,null,null,null,null,null,null,0,null,"","","",""]
[null,null,null,null,null,null,null,null,0,null,"","","",""]
[null,null,null,null,null,null,null,null,0,null,"","","",""]
[null,null,null,null,null,null,null,null,0,null,"","","",""]
[null,null,null,null,null,null,null,null,0,null,"","","",""]
[null,null,null,null,null,null,null,null,0,null,"","","",""]
[null,null,null,null,null,null,null,null,0,null,"","","",""]
[null,null,null,null,null,null,null,null,0,null,"","","",""]
[null,null,null,null,null,null,null,null,0,null,"","","",""]
[null,null,null,null,null,null,null,null,0,null,"","","",""]
[null,null,null,null,null,null,null,null,0,null,"","","",""]
[null,null,null,null,null,null,null,null,0,null,"","","",""]
[null,null,null,null,null,null,null,null,0,null,"","","",""]
[null,null,null,null,null,null,null,null,{"$f":"IFERROR(G1191+H1191,\"\")","v":0},null,{"$f":"IFERROR(IF(J1191<>\"\",F1191*J1191,\"\"),\"\")","v":""},{"$f":"IFERROR(IF(J1191<>\"\",G1191*J1191,\"\"),\"\")","v":""},{"$f":"IFERROR(IF(J1191<>\"\",H1191*J1191,\"\"),\"\")","v":""},{"$f":"IFERROR(L1191+M1191,\"\")","v":""}]
[null,null,null,null,null,null,null,null,0,null,"","","",""]
[null,null,null,null,null,null,null,null,0,null,"","","",""]
[null,null,null,null,null,null,null,null,0,null,"","","",""]
[null,null,null,null,null,null,null,null,0,null,"","","",""]
[null,null,null,null,null,null,null,null,0,null,"","","",""]
[null,null,null,null,null,null,null,null,0,null,"","","",""]
[null,null,null,null,null,null,null,null,0,null,"","","",""]
[null,null,null,null,null,null,null,null,0,null,"","","",""]
[null,null,null,null,null,null,null,null,0,null,"","","",""]
[null,null,null,null,null,null,null,null,0,null,"","","",""]
[null,null,null,null,null,null,null,null,0,null,"","","",""]
[null,null,null,null,null,null,null,null,0,null,"","","",""]
[null,null,null,null,null,null,null,null,0,null,"","","",""]
[null,null,null,null,null,null,null,null,0,null,"","","",""]
[null,null,null,null,null,null,null,null,0,null,"","","",""]
[null,null,null,null,null,null,null,null,0,null,"","","",""]
[null,null,null,null,null,null,null,null,0,null,"","","",""]
[null,null,null,null,null,null,null,null,0,null,"","","",""]
[null,null,null,null,null,null,null,null,0,null,"","","",""]
[null,null,null,null,null,null,null,null,0,null,"","","",""]
[null,null,null,null,null,null,null,null,0,null,"","","",""]
[null,null,null,null,null,null,null,null,0,null,"","","",""]
[null,null,null,null,null,null,null,null,0,null,"","","",""]
[null,null,null,null,null,null,null,null,0,null,"","","",""]
[null,null,null,null,null,null,null,null,0,null,"","","",""]
[null,null,null,null,null,null,null,null,0,null,"","","",""]
[null,null,null,null,null,null,null,null,0,null,"","","",""]
[null,null,null,null,null,null,null,null,0,null,"","","",""]
[null,null,null,null,null,null,null,null,0,null,"","","",""]
[null,null,null,null,null,null,null,null,0,null,"","","",""]
[null,null,null,null,null,null,null,null,0,null,"","","",""]
[null,null,null,null,null,null,null,null,0,null,"","","",""]
[null,null,null,null,null,null,null,null,0,null,"","","",""]
[null,null,null,null,null,null,null,null,0,null,"","","",""]
[null,null,null,null,null,null,null,null,0,null,"","","",""]
[null,null,null,null,null,null,null,null,0,null,"","","",""]
[null,null,null,null,null,null,null,null,0,null,"","","",""]
[null,null,null,null,null,null,null,null,0,null,"","","",""]
[null,null,null,null,null,null,null,null,0,null,"","","",""]
[null,null,null,null,null,null,null,null,0,null,"","","",""]
[null,null,null,null,null,null,null,null,0,null,"","","",""]
[null,null,null,null,null,null,null,null,0,null,"","","",""]
[null,null,null,null,null,null,null,null,0,null,"","","",""]
[null,null,null,null,null,null,null,null,0,null,"","","",""]
[null,null,null,null,null,null,null,null,0,null,"","","",""]
[null,null,null,null,null,null,null,null,0,null,"","","",""]
[null,null,null,null,null,null,null,null,0,null,"","","",""]
[null,null,null,null,null,null,null,null,0,null,"","","",""]
[null,null,null,null,null,null,null,null,0,null,"","","",""]
[null,null,null,null,null,null,null,null,0,null,"","","",""]
[null,null,null,null,null,null,null,null,0,null,"","","",""]
[null,null,null,null,null,null,null,null,0,null,"","","",""]
[null,null,null,null,null,null,null,null,0,null,"","","",""]
[null,null,null,null,null,null,null,null,0,null,"","","",""]
[null,null,null,null,null,null,null,null,0,null,"","","",""]
[null,null,null,null,null,null,null,null,0,null,"","","",""]
[null,null,null,null,null,null,null,null,0,null,"","","",""]
[null,null,null,null,null,null,null,null,0,null,"","","",""]
[null,null,null,null,null,null,null,null,0,null,"","","",""]
[null,null,null,null,null,null,null,null,0,null,"","","",""]
[null,null,null,null,null,null,null,null,0,null,"","","",""]
[null,null,null,null,null,null,null,null,0,null,"","","",""]
[null,null,null,null,null,null,null,null,0,null,"","","",""]
[null,null,null,null,null,null,null,null,{"$f":"IFERROR(G1255+H1255,\"\")","v":0},null,{"$f":"IFERROR(IF(J1255<>\"\",F1255*J1255,\"\"),\"\")","v":""},{"$f":"IFERROR(IF(J1255<>\"\",G1255*J1255,\"\"),\"\")","v":""},{"$f":"IFERROR(IF(J1255<>\"\",H1255*J1255,\"\"),\"\")","v":""},{"$f":"IFERROR(L1255+M1255,\"\")","v":""}]
[null,null,null,null,null,null,null,null,0,null,"","","",""]
[null,null,null,null,null,null,null,null,0,null,"","","",""]
[null,null,null,null,null,null,null,null,0,null,"","","",""]
[null,null,null,null,null,null,null,null,0,null,"","","",""]
[null,null,null,null,null,null,null,null,0,null,"","","",""]
[null,null,null,null,null,null,null,null,0,null,"","","",""]
[null,null,null,null,null,null,null,null,0,null,"","","",""]
[null,null,null,null,null,null,null,null,0,null,"","","",""]
[null,null,null,null,null,null,null,null,0,null,"","","",""]
[null,null,null,null,null,null,null,null,0,null,"","","",""]
[null,null,null,null,null,null,null,null,0,null,"","","",""]
[null,null,null,null,null,null,null,null,0,null,"","","",""]
[null,null,null,null,null,null,null,null,0,null,"","","",""]
[null,null,null,null,null,null,null,null,0,null,"","","",""]
[null,null,null,null,null,null,null,null,0,null,"","","",""]
[null,null,null,null,null,null,null,null,0,null,"","","",""]
[null,null,null,null,null,null,null,null,0,null,"","","",""]
[null,null,null,null,null,null,null,null,0,null,"","","",""]
[null,null,null,null,null,null,null,null,0,null,"","","",""]
[null,null,null,null,null,null,null,null,0,null,"","","",""]
[null,null,null,null,null,null,null,null,0,null,"","","",""]
[null,null,null,null,null,null,null,null,0,null,"","","",""]
[null,null,null,null,null,null,null,null,0,null,"","","",""]
[null,null,null,null,null,null,null,null,0,null,"","","",""]
[null,null,null,null,null,null,null,null,0,null,"","","",""]
[null,null,null,null,null,null,null,null,0,null,"","","",""]
[null,null,null,null,null,null,null,null,0,null,"","","",""]
[null,null,null,null,null,null,null,null,0,null,"","","",""]
[null,null,null,null,null,null,null,null,0,null,"","","",""]
[null,null,null,null,null,null,null,null,0,null,"","","",""]
[null,null,null,null,null,null,null,null,0,null,"","","",""]
[null,null,null,null,null,null,null,null,0,null,"","","",""]
[null,null,null,null,null,null,null,null,0,null,"","","",""]
[null,null,null,null,null,null,null,null,0,null,"","","",""]
[null,null,null,null,null,null,null,null,0,null,"","","",""]
[null,null,null,null,null,null,null,null,0,null,"","","",""]
[null,null,null,null,null,null,null,null,0,null,"","","",""]
[null,null,null,null,null,null,null,null,0,null,"","","",""]
[null,null,null,null,null,null,null,null,0,null,"","","",""]
[null,null,null,null,null,null,null,null,0,null,"","","",""]
[null,null,null,null,null,null,null,null,0,null,"","","",""]
[null,null,null,null,null,null,null,null,0,null,"","","",""]
[null,null,null,null,null,null,null,null,0,null,"","","",""]
[null,null,null,null,null,null,null,null,0,null,"","","",""]
[null,null,null,null,null,null,null,null,0,null,"","","",""]
[null,null,null,null,null,null,null,null,0,null,"","","",""]
[null,null,null,null,null,null,null,null,0,null,"","","",""]
[null,null,null,null,null,null,null,null,0,null,"","","",""]
[null,null,null,null,null,null,null,null,0,null,"","","",""]
[null,null,null,null,null,null,null,null,0,null,"","","",""]
[null,null,null,null,null,null,null,null,0,null,"","","",""]
[null,null,null,null,null,null,null,null,0,null,"","","",""]
[null,null,null,null,null,null,null,null,0,null,"","","",""]
[null,null,null,null,null,null,null,null,0,null,"","","",""]
[null,null,null,null,null,null,null,null,0,null,"","","",""]
[null,null,null,null,null,null,null,null,0,null,"","","",""]
[null,null,null,null,null,null,null,null,0,null,"","","",""]
[null,null,null,null,null,null,null,null,0,null,"","","",""]
[null,null,null,null,null,null,null,null,0,null,"","","",""]
[null,null,null,null,null,null,null,null,0,null,"","","",""]
[null,null,null,null,null,null,null,null,0,null,"","","",""]
[null,null,null,null,null,null,null,null,0,null,"","","",""]
[null,null,null,null,null,null,null,null,0,null,"","","",""]
[null,null,null,null,null,null,null,null,{"$f":"IFERROR(G1319+H1319,\"\")","v":0},null,{"$f":"IFERROR(IF(J1319<>\"\",F1319*J1319,\"\"),\"\")","v":""},{"$f":"IFERROR(IF(J1319<>\"\",G1319*J1319,\"\"),\"\")","v":""},{"$f":"IFERROR(IF(J1319<>\"\",H1319*J1319,\"\"),\"\")","v":""},{"$f":"IFERROR(L1319+M1319,\"\")","v":""}]
[null,null,null,null,null,null,null,null,0,null,"","","",""]
[null,null,null,null,null,null,null,null,0,null,"","","",""]
[null,null,null,null,null,null,null,null,0,null,"","","",""]
[null,null,null,null,null,null,null,null,0,null,"","","",""]
[null,null,null,null,null,null,null,null,0,null,"","","",""]
[null,null,null,null,null,null,null,null,0,null,"","","",""]
[null,null,null,null,null,null,null,null,0,null,"","","",""]
[null,null,null,null,null,null,null,null,0,null,"","","",""]
[null,null,null,null,null,null,null,null,0,null,"","","",""]
[null,null,null,null,null,null,null,null,0,null,"","","",""]
[null,null,null,null,null,null,null,null,0,null,"","","",""]
[null,null,null,null,null,null,null,null,0,null,"","","",""]
[null,null,null,null,null,null,null,null,0,null,"","","",""]
[null,null,null,null,null,null,null,null,0,null,"","","",""]
[null,null,null,null,null,null,null,null,0,null,"","","",""]
[null,null,null,null,null,null,null,null,0,null,"","","",""]
[null,null,null,null,null,null,null,null,0,null,"","","",""]
[null,null,null,null,null,null,null,null,0,null,"","","",""]
[null,null,null,null,null,null,null,null,0,null,"","","",""]
[null,null,null,null,null,null,null,null,0,null,"","","",""]
[null,null,null,null,null,null,null,null,0,null,"","","",""]
[null,null,null,null,null,null,null,null,0,null,"","","",""]
[null,null,null,null,null,null,null,null,0,null,"","","",""]
[null,null,null,null,null,null,null,null,0,null,"","","",""]
[null,null,null,null,null,null,null,null,0,null,"","","",""]
[null,null,null,null,null,null,null,null,0,null,"","","",""]
[null,null,null,null,null,null,null,null,0,null,"","","",""]
[null,null,null,null,null,null,null,null,0,null,"","","",""]
[null,null,null,null,null,null,null,null,0,null,"","","",""]
[null,null,null,null,null,null,null,null,0,null,"","","",""]
[null,null,null,null,null,null,null,null,0,null,"","","",""]
[null,null,null,null,null,null,null,null,0,null,"","","",""]
[null,null,null,null,null,null,null,null,0,null,"","","",""]
[null,null,null,null,null,null,null,null,0,null,"","","",""]
[null,null,null,null,null,null,null,null,0,null,"","","",""]
[null,null,null,null,null,null,null,null,0,null,"","","",""]
[null,null,null,null,null,null,null,null,0,null,"","","",""]
[null,null,null,null,null,null,null,null,0,null,"","","",""]
[null,null,null,null,null,null,null,null,0,null,"","","",""]
[null,null,null,null,null,null,null,null,0,null,"","","",""]
[null,null,null,null,null,null,null,null,0,null,"","","",""]
[null,null,null,null,null,null,null,null,0,null,"","","",""]
[null,null,null,null,null,null,null,null,0,null,"","","",""]
[null,null,null,null,null,null,null,null,0,null,"","","",""]
[null,null,null,null,null,null,null,null,0,null,"","","",""]
[null,null,null,null,null,null,null,null,0,null,"","","",""]
[null,null,null,null,null,null,null,null,0,null,"","","",""]
[null,null,null,null,null,null,null,null,0,null,"","","",""]
[null,null,null,null,null,null,null,null,0,null,"","","",""]
[null,null,null,null,null,null,null,null,0,null,"","","",""]
[null,null,null,null,null,null,null,null,0,null,"","","",""]
[null,null,null,null,null,null,null,null,0,null,"","","",""]
[null,null,null,null,null,null,null,null,0,null,"","","",""]
[null,null,null,null,null,null,null,null,0,null,"","","",""]
[null,null,null,null,null,null,null,null,0,null,"","","",""]
[null,null,null,null,null,null,null,null,0,null,"","","",""]
[null,null,null,null,null,null,null,null,0,null,"","","",""]
[null,null,null,null,null,null,null,null,0,null,"","","",""]
[null,null,null,null,null,null,null,null,0,null,"","","",""]
[null,null,null,null,null,null,null,null,0,null,"","","",""]
[null,null,null,null,null,null,null,null,0,null,"","","",""]
[null,null,null,null,null,null,null,null,0,null,"","","",""]
[null,null,null,null,null,null,null,null,0,null,"","","",""]
[null,null,null,null,null,null,null,null,{"$f":"IFERROR(G1383+H1383,\"\")","v":0},null,{"$f":"IFERROR(IF(J1383<>\"\",F1383*J1383,\"\"),\"\")","v":""},{"$f":"IFERROR(IF(J1383<>\"\",G1383*J1383,\"\"),\"\")","v":""},{"$f":"IFERROR(IF(J1383<>\"\",H1383*J1383,\"\"),\"\")","v":""},{"$f":"IFERROR(L1383+M1383,\"\")","v":""}]
[null,null,null,null,null,null,null,null,0,null,"","","",""]
[null,null,null,null,null,null,null,null,0,null,"","","",""]
[null,null,null,null,null,null,null,null,0,null,"","","",""]
[null,null,null,null,null,null,null,null,0,null,"","","",""]
[null,null,null,null,null,null,null,null,0,null,"","","",""]
[null,null,null,null,null,null,null,null,0,null,"","","",""]
[null,null,null,null,null,null,null,null,0,null,"","","",""]
[null,null,null,null,null,null,null,null,0,null,"","","",""]
[null,null,null,null,null,null,null,null,0,null,"","","",""]
[null,null,null,null,null,null,null,null,0,null,"","","",""]
[null,null,null,null,null,null,null,null,0,null,"","","",""]
[null,null,null,null,null,null,null,null,0,null,"","","",""]
[null,null,null,null,null,null,null,null,0,null,"","","",""]
[null,null,null,null,null,null,null,null,0,null,"","","",""]
[null,null,null,null,null,null,null,null,0,null,"","","",""]
[null,null,null,null,null,null,null,null,0,null,"","","",""]
[null,null,null,null,null,null,null,null,0,null,"","","",""]
[null,null,null,null,null,null,null,null,0,null,"","","",""]
[null,null,null,null,null,null,null,null,0,null,"","","",""]
[null,null,null,null,null,null,null,null,0,null,"","","",""]
[null,null,null,null,null,null,null,null,0,null,"","","",""]
[null,null,null,null,null,null,null,null,0,null,"","","",""]
[null,null,null,null,null,null,null,null,0,null,"","","",""]
[null,null,null,null,null,null,null,null,0,null,"","","",""]
[null,null,null,null,null,null,null,null,0,null,"","","",""]
[null,null,null,null,null,null,null,null,0,null,"","","",""]
[null,null,null,null,null,null,null,null,0,null,"","","",""]
[null,null,null,null,null,null,null,null,0,null,"","","",""]
[null,null,null,null,null,null,null,null,0,null,"","","",""]
[null,null,null,null,null,null,null,null,0,null,"","","",""]
[null,null,null,null,null,null,null,null,0,null,"","","",""]
[null,null,null,null,null,null,null,null,0,null,"","","",""]
[null,null,null,null,null,null,null,null,0,null,"","","",""]
[null,null,null,null,null,null,null,null,0,null,"","","",""]
[null,null,null,null,null,null,null,null,0,null,"","","",""]
[null,null,null,null,null,null,null,null,0,null,"","","",""]
[null,null,null,null,null,null,null,null,0,null,"","","",""]
[null,null,null,null,null,null,null,null,0,null,"","","",""]
[null,null,null,null,null,null,null,null,0,null,"","","",""]
[null,null,null,null,null,null,null,null,0,null,"","","",""]
[null,null,null,null,null,null,null,null,0,null,"","","",""]
[null,null,null,null,null,null,null,null,0,null,"","","",""]
[null,null,null,null,null,null,null,null,0,null,"","","",""]
[null,null,null,null,null,null,null,null,0,null,"","","",""]
[null,null,null,null,null,null,null,null,0,null,"","","",""]
[null,null,null,null,null,null,null,null,0,null,"","","",""]
[null,null,null,null,null,null,null,null,0,null,"","","",""]
[null,null,null,null,null,null,null,null,0,null,"","","",""]
[null,null,null,null,null,null,null,null,0,null,"","","",""]
[null,null,null,null,null,null,null,null,0,null,"","","",""]
[null,null,null,null,null,null,null,null,0,null,"","","",""]
[null,null,null,null,null,null,null,null,0,null,"","","",""]
[null,null,null,null,null,null,null,null,0,null,"","","",""]
[null,null,null,null,null,null,null,null,0,null,"","","",""]
[null,null,null,null,null,null,null,null,0,null,"","","",""]
[null,null,null,null,null,null,null,null,0,null,"","","",""]
[null,null,null,null,null,null,null,null,0,null,"","","",""]
[null,null,null,null,null,null,null,null,0,null,"","","",""]
[null,null,null,null,null,null,null,null,0,null,"","","",""]
[null,null,null,null,null,null,null,null,0,null,"","","",""]
[null,null,null,null,null,null,null,null,0,null,"","","",""]
[null,null,null,null,null,null,null,null,0,null,"","","",""]
[null,null,null,null,null,null,null,null,0,null,"","","",""]
[null,null,null,null,null,null,null,null,{"$f":"IFERROR(G1447+H1447,\"\")","v":0},null,{"$f":"IFERROR(IF(J1447<>\"\",F1447*J1447,\"\"),\"\")","v":""},{"$f":"IFERROR(IF(J1447<>\"\",G1447*J1447,\"\"),\"\")","v":""},{"$f":"IFERROR(IF(J1447<>\"\",H1447*J1447,\"\"),\"\")","v":""},{"$f":"IFERROR(L1447+M1447,\"\")","v":""}]
[null,null,null,null,null,null,null,null,0,null,"","","",""]
[null,null,null,null,null,null,null,null,0,null,"","","",""]
[null,null,null,null,null,null,null,null,0,null,"","","",""]
[null,null,null,null,null,null,null,null,0,null,"","","",""]
[null,null,null,null,null,null,null,null,0,null,"","","",""]
[null,null,null,null,null,null,null,null,0,null,"","","",""]
[null,null,null,null,null,null,null,null,0,null,"","","",""]
[null,null,null,null,null,null,null,null,0,null,"","","",""]
[null,null,null,null,null,null,null,null,0,null,"","","",""]
[null,null,null,null,null,null,null,null,0,null,"","","",""]
[null,null,null,null,null,null,null,null,0,null,"","","",""]
[null,null,null,null,null,null,null,null,0,null,"","","",""]
[null,null,null,null,null,null,null,null,0,null,"","","",""]
[null,null,null,null,null,null,null,null,0,null,"","","",""]
[null,null,null,null,null,null,null,null,0,null,"","","",""]
[null,null,null,null,null,null,null,null,0,null,"","","",""]
[null,null,null,null,null,null,null,null,0,null,"","","",""]
[null,null,null,null,null,null,null,null,0,null,"","","",""]
[null,null,null,null,null,null,null,null,0,null,"","","",""]
[null,null,null,null,null,null,null,null,0,null,"","","",""]
[null,null,null,null,null,null,null,null,0,null,"","","",""]
[null,null,null,null,null,null,null,null,0,null,"","","",""]
[null,null,null,null,null,null,null,null,0,null,"","","",""]
[null,null,null,null,null,null,null,null,0,null,"","","",""]
[null,null,null,null,null,null,null,null,0,null,"","","",""]
[null,null,null,null,null,null,null,null,0,null,"","","",""]
[null,null,null,null,null,null,null,null,0,null,"","","",""]
[null,null,null,null,null,null,null,null,0,null,"","","",""]
[null,null,null,null,null,null,null,null,0,null,"","","",""]
[null,null,null,null,null,null,null,null,0,null,"","","",""]
[null,null,null,null,null,null,null,null,0,null,"","","",""]
[null,null,null,null,null,null,null,null,0,null,"","","",""]
[null,null,null,null,null,null,null,null,0,null,"","","",""]
[null,null,null,null,null,null,null,null,0,null,"","","",""]
[null,null,null,null,null,null,null,null,0,null,"","","",""]
[null,null,null,null,null,null,null,null,0,null,"","","",""]
[null,null,null,null,null,null,null,null,0,null,"","","",""]
[null,null,null,null,null,null,null,null,0,null,"","","",""]
[null,null,null,null,null,null,null,null,0,null,"","","",""]
[null,null,null,null,null,null,null,null,0,null,"","","",""]
[null,null,null,null,null,null,null,null,0,null,"","","",""]
[null,null,null,null,null,null,null,null,0,null,"","","",""]
[null,null,null,null,null,null,null,null,0,null,"","","",""]
[null,null,null,null,null,null,null,null,0,null,"","","",""]
[null,null,null,null,null,null,null,null,0,null,"","","",""]
[null,null,null,null,null,null,null,null,0,null,"","","",""]
[null,null,null,null,null,null,null,null,0,null,"","","",""]
[null,null,null,null,null,null,null,null,0,null,"","","",""]
[null,null,null,null,null,null,null,null,0,null,"","","",""]
[null,null,null,null,null,null,null,null,0,null,"","","",""]
[null,null,null,null,null,null,null,null,0,null,"","","",""]
[null,null,null,null,null,null,null,null,0,null,"","","",""]
[null,null,null,null,null,null,null,null,0,null,"","","",""]
[null,null,null,null,null,null,null,null,0,null,"","","",""]
[null,null,null,null,null,null,null,null,0,null,"","","",""]
[null,null,null,null,null,null,null,null,0,null,"","","",""]
[null,null,null,null,null,null,null,null,0,null,"","","",""]
[null,null,null,null,null,null,null,null,0,null,"","","",""]
[null,null,null,null,null,null,null,null,0,null,"","","",""]
[null,null,null,null,null,null,null,null,0,null,"","","",""]
[null,null,null,null,null,null,null,null,0,null,"","","",""]
[null,null,null,null,null,null,null,null,0,null,"","","",""]
[null,null,null,null,null,null,null,null,0,null,"","","",""]
[null,null,null,null,null,null,null,null,{"$f":"IFERROR(G1511+H1511,\"\")","v":0},null,{"$f":"IFERROR(IF(J1511<>\"\",F1511*J1511,\"\"),\"\")","v":""},{"$f":"IFERROR(IF(J1511<>\"\",G1511*J1511,\"\"),\"\")","v":""},{"$f":"IFERROR(IF(J1511<>\"\",H1511*J1511,\"\"),\"\")","v":""},{"$f":"IFERROR(L1511+M1511,\"\")","v":""}]
[null,null,null,null,null,null,null,null,0,null,"","","",""]
[null,null,null,null,null,null,null,null,0,null,"","","",""]
[null,null,null,null,null,null,null,null,0,null,"","","",""]
[null,null,null,null,null,null,null,null,0,null,"","","",""]
[null,null,null,null,null,null,null,null,0,null,"","","",""]
[null,null,null,null,null,null,null,null,0,null,"","","",""]
[null,null,null,null,null,null,null,null,0,null,"","","",""]
[null,null,null,null,null,null,null,null,0,null,"","","",""]
[null,null,null,null,null,null,null,null,0,null,"","","",""]
[null,null,null,null,null,null,null,null,0,null,"","","",""]
[null,null,null,null,null,null,null,null,0,null,"","","",""]
[null,null,null,null,null,null,null,null,0,null,"","","",""]
[null,null,null,null,null,null,null,null,0,null,"","","",""]
[null,null,null,null,null,null,null,null,0,null,"","","",""]
[null,null,null,null,null,null,null,null,0,null,"","","",""]
[null,null,null,null,null,null,null,null,0,null,"","","",""]
[null,null,null,null,null,null,null,null,0,null,"","","",""]
[null,null,null,null,null,null,null,null,0,null,"","","",""]
[null,null,null,null,null,null,null,null,0,null,"","","",""]
[null,null,null,null,null,null,null,null,0,null,"","","",""]
[null,null,null,null,null,null,null,null,0,null,"","","",""]
[null,null,null,null,null,null,null,null,0,null,"","","",""]
[null,null,null,null,null,null,null,null,0,null,"","","",""]
[null,null,null,null,null,null,null,null,0,null,"","","",""]
[null,null,null,null,null,null,null,null,0,null,"","","",""]
[null,null,null,null,null,null,null,null,0,null,"","","",""]
[null,null,null,null,null,null,null,null,0,null,"","","",""]
[null,null,null,null,null,null,null,null,0,null,"","","",""]
[null,null,null,null,null,null,null,null,0,null,"","","",""]
[null,null,null,null,null,null,null,null,0,null,"","","",""]
[null,null,null,null,null,null,null,null,0,null,"","","",""]
[null,null,null,null,null,null,null,null,0,null,"","","",""]
[null,null,null,null,null,null,null,null,0,null,"","","",""]
[null,null,null,null,null,null,null,null,0,null,"","","",""]
[null,null,null,null,null,null,null,null,0,null,"","","",""]
[null,null,null,null,null,null,null,null,0,null,"","","",""]
[null,null,null,null,null,null,null,null,0,null,"","","",""]
[null,null,null,null,null,null,null,null,0,null,"","","",""]
[null,null,null,null,null,null,null,null,0,null,"","","",""]
[null,null,null,null,null,null,null,null,0,null,"","","",""]
[null,null,null,null,null,null,null,null,0,null,"","","",""]
[null,null,null,null,null,null,null,null,0,null,"","","",""]
[null,null,null,null,null,null,null,null,0,null,"","","",""]
[null,null,null,null,null,null,null,null,0,null,"","","",""]
[null,null,null,null,null,null,null,null,0,null,"","","",""]
[null,null,null,null,null,null,null,null,0,null,"","","",""]
[null,null,null,null,null,null,null,null,0,null,"","","",""]
[null,null,null,null,null,null,null,null,0,null,"","","",""]
[null,null,null,null,null,null,null,null,0,null,"","","",""]
[null,null,null,null,null,null,null,null,0,null,"","","",""]
[null,null,null,null,null,null,null,null,0,null,"","","",""]
[null,null,null,null,null,null,null,null,0,null,"","","",""]
[null,null,null,null,null,null,null,null,0,null,"","","",""]
[null,null,null,null,null,null,null,null,0,null,"","","",""]
[null,null,null,null,null,null,null,null,0,null,"","","",""]
[null,null,null,null,null,null,null,null,0,null,"","","",""]
[null,null,null,null,null,null,null,null,0,null,"","","",""]
[null,null,null,null,null,null,null,null,0,null,"","","",""]
[null,null,null,null,null,null,null,null,0,null,"","","",""]
[null,null,null,null,null,null,null,null,0,null,"","","",""]
[null,null,null,null,null,null,null,null,0,null,"","","",""]
[null,null,null,null,null,null,null,null,0,null,"","","",""]
[null,null,null,null,null,null,null,null,0,null,"","","",""]
[null,null,null,null,null,null,null,null,{"$f":"IFERROR(G1575+H1575,\"\")","v":0},null,{"$f":"IFERROR(IF(J1575<>\"\",F1575*J1575,\"\"),\"\")","v":""},{"$f":"IFERROR(IF(J1575<>\"\",G1575*J1575,\"\"),\"\")","v":""},{"$f":"IFERROR(IF(J1575<>\"\",H1575*J1575,\"\"),\"\")","v":""},{"$f":"IFERROR(L1575+M1575,\"\")","v":""}]
[null,null,null,null,null,null,null,null,0,null,"","","",""]
[null,null,null,null,null,null,null,null,0,null,"","","",""]
[null,null,null,null,null,null,null,null,0,null,"","","",""]
[null,null,null,null,null,null,null,null,0,null,"","","",""]
[null,null,null,null,null,null,null,null,0,null,"","","",""]
[null,null,null,null,null,null,null,null,0,null,"","","",""]
[null,null,null,null,null,null,null,null,0,null,"","","",""]
[null,null,null,null,null,null,null,null,0,null,"","","",""]
[null,null,null,null,null,null,null,null,0,null,"","","",""]
[null,null,null,null,null,null,null,null,0,null,"","","",""]
[null,null,null,null,null,null,null,null,0,null,"","","",""]
[null,null,null,null,null,null,null,null,0,null,"","","",""]
[null,null,null,null,null,null,null,null,0,null,"","","",""]
[null,null,null,null,null,null,null,null,0,null,"","","",""]
[null,null,null,null,null,null,null,null,0,null,"","","",""]
[null,null,null,null,null,null,null,null,0,null,"","","",""]
[null,null,null,null,null,null,null,null,0,null,"","","",""]
[null,null,null,null,null,null,null,null,0,null,"","","",""]
[null,null,null,null,null,null,null,null,0,null,"","","",""]
[null,null,null,null,null,null,null,null,0,null,"","","",""]
[null,null,null,null,null,null,null,null,0,null,"","","",""]
[null,null,null,null,null,null,null,null,0,null,"","","",""]
[null,null,null,null,null,null,null,null,0,null,"","","",""]
[null,null,null,null,null,null,null,null,0,null,"","","",""]
[null,null,null,null,null,null,null,null,0,null,"","","",""]
[null,null,null,null,null,null,null,null,0,null,"","","",""]
[null,null,null,null,null,null,null,null,0,null,"","","",""]
[null,null,null,null,null,null,null,null,0,null,"","","",""]
[null,null,null,null,null,null,null,null,0,null,"","","",""]
[null,null,null,null,null,null,null,null,0,null,"","","",""]
[null,null,null,null,null,null,null,null,0,null,"","","",""]
[null,null,null,null,null,null,null,null,0,null,"","","",""]
[null,null,null,null,null,null,null,null,0,null,"","","",""]
[null,null,null,null,null,null,null,null,0,null,"","","",""]
[null,null,null,null,null,null,null,null,0,null,"","","",""]
[null,null,null,null,null,null,null,null,0,null,"","","",""]
[null,null,null,null,null,null,null,null,0,null,"","","",""]
[null,null,null,null,null,null,null,null,0,null,"","","",""]
[null,null,null,null,null,null,null,null,0,null,"","","",""]
[null,null,null,null,null,null,null,null,0,null,"","","",""]
[null,null,null,null,null,null,null,null,0,null,"","","",""]
[null,null,null,null,null,null,null,null,0,null,"","","",""]
[null,null,null,null,null,null,null,null,0,null,"","","",""]
[null,null,null,null,null,null,null,null,0,null,"","","",""]
[null,null,null,null,null,null,null,null,0,null,"","","",""]
[null,null,null,null,null,null,null,null,0,null,"","","",""]
[null,null,null,null,null,null,null,null,0,null,"","","",""]
[null,null,null,null,null,null,null,null,0,null,"","","",""]
[null,null,null,null,null,null,null,null,0,null,"","","",""]
[null,null,null,null,null,null,null,null,0,null,"","","",""]
[null,null,null,null,null,null,null,null,0,null,"","","",""]
[null,null,null,null,null,null,null,null,0,null,"","","",""]
[null,null,null,null,null,null,null,null,0,null,"","","",""]
[null,null,null,null,null,null,null,null,0,null,"","","",""]
[null,null,null,null,null,null,null,null,0,null,"","","",""]
[null,null,null,null,null,null,null,null,0,null,"","","",""]
[null,null,null,null,null,null,null,null,0,null,"","","",""]
[null,null,null,null,null,null,null,null,0,null,"","","",""]
[null,null,null,null,null,null,null,null,0,null,"","","",""]
[null,null,null,null,null,null,null,null,0,null,"","","",""]
[null,null,null,null,null,null,null,null,0,null,"","","",""]
[null,null,null,null,null,null,null,null,0,null,"","","",""]
[null,null,null,null,null,null,null,null,0,null,"","","",""]
[null,null,null,null,null,null,null,null,{"$f":"IFERROR(G1639+H1639,\"\")","v":0},null,{"$f":"IFERROR(IF(J1639<>\"\",F1639*J1639,\"\"),\"\")","v":""},{"$f":"IFERROR(IF(J1639<>\"\",G1639*J1639,\"\"),\"\")","v":""},{"$f":"IFERROR(IF(J1639<>\"\",H1639*J1639,\"\"),\"\")","v":""},{"$f":"IFERROR(L1639+M1639,\"\")","v":""}]
[null,null,null,null,null,null,null,null,0,null,"","","",""]
[null,null,null,null,null,null,null,null,0,null,"","","",""]
[null,null,null,null,null,null,null,null,0,null,"","","",""]
[null,null,null,null,null,null,null,null,0,null,"","","",""]
[null,null,null,null,null,null,null,null,0,null,"","","",""]
[null,null,null,null,null,null,null,null,0,null,"","","",""]
[null,null,null,null,null,null,null,null,0,null,"","","",""]
[null,null,null,null,null,null,null,null,0,null,"","","",""]
[null,null,null,null,null,null,null,null,0,null,"","","",""]
[null,null,null,null,null,null,null,null,0,null,"","","",""]
[null,null,null,null,null,null,null,null,0,null,"","","",""]
[null,null,null,null,null,null,null,null,0,null,"","","",""]
[null,null,null,null,null,null,null,null,0,null,"","","",""]
[null,null,null,null,null,null,null,null,0,null,"","","",""]
[null,null,null,null,null,null,null,null,0,null,"","","",""]
[null,null,null,null,null,null,null,null,0,null,"","","",""]
[null,null,null,null,null,null,null,null,0,null,"","","",""]
[null,null,null,null,null,null,null,null,0,null,"","","",""]
[null,null,null,null,null,null,null,null,0,null,"","","",""]
[null,null,null,null,null,null,null,null,0,null,"","","",""]
[null,null,null,null,null,null,null,null,0,null,"","","",""]
[null,null,null,null,null,null,null,null,0,null,"","","",""]
[null,null,null,null,null,null,null,null,0,null,"","","",""]
[null,null,null,null,null,null,null,null,0,null,"","","",""]
[null,null,null,null,null,null,null,null,0,null,"","","",""]
[null,null,null,null,null,null,null,null,0,null,"","","",""]
[null,null,null,null,null,null,null,null,0,null,"","","",""]
[null,null,null,null,null,null,null,null,0,null,"","","",""]
[null,null,null,null,null,null,null,null,0,null,"","","",""]
[null,null,null,null,null,null,null,null,0,null,"","","",""]
[null,null,null,null,null,null,null,null,0,null,"","","",""]
[null,null,null,null,null,null,null,null,0,null,"","","",""]
[null,null,null,null,null,null,null,null,0,null,"","","",""]
[null,null,null,null,null,null,null,null,0,null,"","","",""]
[null,null,null,null,null,null,null,null,0,null,"","","",""]
[null,null,null,null,null,null,null,null,0,null,"","","",""]
[null,null,null,null,null,null,null,null,0,null,"","","",""]
[null,null,null,null,null,null,null,null,0,null,"","","",""]
[null,null,null,null,null,null,null,null,0,null,"","","",""]
[null,null,null,null,null,null,null,null,0,null,"","","",""]
[null,null,null,null,null,null,null,null,0,null,"","","",""]
[null,null,null,null,null,null,null,null,0,null,"","","",""]
[null,null,null,null,null,null,null,null,0,null,"","","",""]
[null,null,null,null,null,null,null,null,0,null,"","","",""]
[null,null,null,null,null,null,null,null,0,null,"","","",""]
[null,null,null,null,null,null,null,null,0,null,"","","",""]
[null,null,null,null,null,null,null,null,0,null,"","","",""]
[null,null,null,null,null,null,null,null,0,null,"","","",""]
[null,null,null,null,null,null,null,null,0,null,"","","",""]
[null,null,null,null,null,null,null,null,0,null,"","","",""]
[null,null,null,null,null,null,null,null,0,null,"","","",""]
[null,null,null,null,null,null,null,null,0,null,"","","",""]
[null,null,null,null,null,null,null,null,0,null,"","","",""]
[null,null,null,null,null,null,null,null,0,null,"","","",""]
[null,null,null,null,null,null,null,null,0,null,"","","",""]
[null,null,null,null,null,null,null,null,0,null,"","","",""]
[null,null,null,null,null,null,null,null,0,null,"","","",""]
[null,null,null,null,null,null,null,null,0,null,"","","",""]
[null,null,null,null,null,null,null,null,0,null,"","","",""]
[null,null,null,null,null,null,null,null,0,null,"","","",""]
[null,null,null,null,null,null,null,null,0,null,"","","",""]
[null,null,null,null,null,null,null,null,0,null,"","","",""]
[null,null,null,null,null,null,null,null,0,null,"","","",""]
[null,null,null,null,null,null,null,null,{"$f":"IFERROR(G1703+H1703,\"\")","v":0},null,{"$f":"IFERROR(IF(J1703<>\"\",F1703*J1703,\"\"),\"\")","v":""},{"$f":"IFERROR(IF(J1703<>\"\",G1703*J1703,\"\"),\"\")","v":""},{"$f":"IFERROR(IF(J1703<>\"\",H1703*J1703,\"\"),\"\")","v":""},{"$f":"IFERROR(L1703+M1703,\"\")","v":""}]
[null,null,null,null,null,null,null,null,0,null,"","","",""]
[null,null,null,null,null,null,null,null,0,null,"","","",""]
[null,null,null,null,null,null,null,null,0,null,"","","",""]
[null,null,null,null,null,null,null,null,0,null,"","","",""]
[null,null,null,null,null,null,null,null,0,null,"","","",""]
[null,null,null,null,null,null,null,null,0,null,"","","",""]
[null,null,null,null,null,null,null,null,0,null,"","","",""]
[null,null,null,null,null,null,null,null,0,null,"","","",""]
[null,null,null,null,null,null,null,null,0,null,"","","",""]
[null,null,null,null,null,null,null,null,0,null,"","","",""]
[null,null,null,null,null,null,null,null,0,null,"","","",""]
[null,null,null,null,null,null,null,null,0,null,"","","",""]
[null,null,null,null,null,null,null,null,0,null,"","","",""]
[null,null,null,null,null,null,null,null,0,null,"","","",""]
[null,null,null,null,null,null,null,null,0,null,"","","",""]
[null,null,null,null,null,null,null,null,0,null,"","","",""]
[null,null,null,null,null,null,null,null,0,null,"","","",""]
[null,null,null,null,null,null,null,null,0,null,"","","",""]
[null,null,null,null,null,null,null,null,0,null,"","","",""]
[null,null,null,null,null,null,null,null,0,null,"","","",""]
[null,null,null,null,null,null,null,null,0,null,"","","",""]
[null,null,null,null,null,null,null,null,0,null,"","","",""]
[null,null,null,null,null,null,null,null,0,null,"","","",""]
[null,null,null,null,null,null,null,null,0,null,"","","",""]
[null,null,null,null,null,null,null,null,0,null,"","","",""]
[null,null,null,null,null,null,null,null,0,null,"","","",""]
[null,null,null,null,null,null,null,null,0,null,"","","",""]
[null,null,null,null,null,null,null,null,0,null,"","","",""]
[null,null,null,null,null,null,null,null,0,null,"","","",""]
[null,null,null,null,null,null,null,null,0,null,"","","",""]
[null,null,null,null,null,null,null,null,0,null,"","","",""]
[null,null,null,null,null,null,null,null,0,null,"","","",""]
[null,null,null,null,null,null,null,null,0,null,"","","",""]
[null,null,null,null,null,null,null,null,0,null,"","","",""]
[null,null,null,null,null,null,null,null,0,null,"","","",""]
[null,null,null,null,null,null,null,null,0,null,"","","",""]
[null,null,null,null,null,null,null,null,0,null,"","","",""]
[null,null,null,null,null,null,null,null,0,null,"","","",""]
[null,null,null,null,null,null,null,null,0,null,"","","",""]
[null,null,null,null,null,null,null,null,0,null,"","","",""]
[null,null,null,null,null,null,null,null,0,null,"","","",""]
[null,null,null,null,null,null,null,null,0,null,"","","",""]
[null,null,null,null,null,null,null,null,0,null,"","","",""]
[null,null,null,null,null,null,null,null,0,null,"","","",""]
[null,null,null,null,null,null,null,null,0,null,"","","",""]
[null,null,null,null,null,null,null,null,0,null,"","","",""]
[null,null,null,null,null,null,null,null,0,null,"","","",""]
[null,null,null,null,null,null,null,null,0,null,"","","",""]
[null,null,null,null,null,null,null,null,0,null,"","","",""]
[null,null,null,null,null,null,null,null,0,null,"","","",""]
[null,null,null,null,null,null,null,null,0,null,"","","",""]
[null,null,null,null,null,null,null,null,0,null,"","","",""]
[null,null,null,null,null,null,null,null,0,null,"","","",""]
[null,null,null,null,null,null,null,null,0,null,"","","",""]
[null,null,null,null,null,null,null,null,0,null,"","","",""]
[null,null,null,null,null,null,null,null,0,null,"","","",""]
[null,null,null,null,null,null,null,null,0,null,"","","",""]
[null,null,null,null,null,null,null,null,0,null,"","","",""]
[null,null,null,null,null,null,null,null,0,null,"","","",""]
[null,null,null,null,null,null,null,null,0,null,"","","",""]
[null,null,null,null,null,null,null,null,0,null,"","","",""]
[null,null,null,null,null,null,null,null,0,null,"","","",""]
[null,null,null,null,null,null,null,null,0,null,"","","",""]
[null,null,null,null,null,null,null,null,{"$f":"IFERROR(G1767+H1767,\"\")","v":0},null,{"$f":"IFERROR(IF(J1767<>\"\",F1767*J1767,\"\"),\"\")","v":""},{"$f":"IFERROR(IF(J1767<>\"\",G1767*J1767,\"\"),\"\")","v":""},{"$f":"IFERROR(IF(J1767<>\"\",H1767*J1767,\"\"),\"\")","v":""},{"$f":"IFERROR(L1767+M1767,\"\")","v":""}]
[null,null,null,null,null,null,null,null,0,null,"","","",""]
[null,null,null,null,null,null,null,null,0,null,"","","",""]
[null,null,null,null,null,null,null,null,0,null,"","","",""]
[null,null,null,null,null,null,null,null,0,null,"","","",""]
[null,null,null,null,null,null,null,null,0,null,"","","",""]
[null,null,null,null,null,null,null,null,0,null,"","","",""]
[null,null,null,null,null,null,null,null,0,null,"","","",""]
[null,null,null,null,null,null,null,null,0,null,"","","",""]
[null,null,null,null,null,null,null,null,0,null,"","","",""]
[null,null,null,null,null,null,null,null,0,null,"","","",""]
[null,null,null,null,null,null,null,null,0,null,"","","",""]
[null,null,null,null,null,null,null,null,0,null,"","","",""]
[null,null,null,null,null,null,null,null,0,null,"","","",""]
[null,null,null,null,null,null,null,null,0,null,"","","",""]
[null,null,null,null,null,null,null,null,0,null,"","","",""]
[null,null,null,null,null,null,null,null,0,null,"","","",""]
[null,null,null,null,null,null,null,null,0,null,"","","",""]
[null,null,null,null,null,null,null,null,0,null,"","","",""]
[null,null,null,null,null,null,null,null,0,null,"","","",""]
[null,null,null,null,null,null,null,null,0,null,"","","",""]
[null,null,null,null,null,null,null,null,0,null,"","","",""]
[null,null,null,null,null,null,null,null,0,null,"","","",""]
[null,null,null,null,null,null,null,null,0,null,"","","",""]
[null,null,null,null,null,null,null,null,0,null,"","","",""]
[null,null,null,null,null,null,null,null,0,null,"","","",""]
[null,null,null,null,null,null,null,null,0,null,"","","",""]
[null,null,null,null,null,null,null,null,0,null,"","","",""]
[null,null,null,null,null,null,null,null,0,null,"","","",""]
[null,null,null,null,null,null,null,null,0,null,"","","",""]
[null,null,null,null,null,null,null,null,0,null,"","","",""]
[null,null,null,null,null,null,null,null,0,null,"","","",""]
[null,null,null,null,null,null,null,null,0,null,"","","",""]
[null,null,null,null,null,null,null,null,0,null,"","","",""]
[null,null,null,null,null,null,null,null,0,null,"","","",""]
[null,null,null,null,null,null,null,null,0,null,"","","",""]
[null,null,null,null,null,null,null,null,0,null,"","","",""]
[null,null,null,null,null,null,null,null,0,null,"","","",""]
[null,null,null,null,null,null,null,null,0,null,"","","",""]
[null,null,null,null,null,null,null,null,0,null,"","","",""]
[null,null,null,null,null,null,null,null,0,null,"","","",""]
[null,null,null,null,null,null,null,null,0,null,"","","",""]
[null,null,null,null,null,null,null,null,0,null,"","","",""]
[null,null,null,null,null,null,null,null,0,null,"","","",""]
[null,null,null,null,null,null,null,null,0,null,"","","",""]
[null,null,null,null,null,null,null,null,0,null,"","","",""]
[null,null,null,null,null,null,null,null,0,null,"","","",""]
[null,null,null,null,null,null,null,null,0,null,"","","",""]
[null,null,null,null,null,null,null,null,0,null,"","","",""]
[null,null,null,null,null,null,null,null,0,null,"","","",""]
[null,null,null,null,null,null,null,null,0,null,"","","",""]
[null,null,null,null,null,null,null,null,0,null,"","","",""]
[null,null,null,null,null,null,null,null,0,null,"","","",""]
[null,null,null,null,null,null,null,null,0,null,"","","",""]
[null,null,null,null,null,null,null,null,0,null,"","","",""]
[null,null,null,null,null,null,null,null,0,null,"","","",""]
[null,null,null,null,null,null,null,null,0,null,"","","",""]
[null,null,null,null,null,null,null,null,0,null,"","","",""]
[null,null,null,null,null,null,null,null,0,null,"","","",""]
[null,null,null,null,null,null,null,null,0,null,"","","",""]
[null,null,null,null,null,null,null,null,0,null,"","","",""]
[null,null,null,null,null,null,null,null,0,null,"","","",""]
[null,null,null,null,null,null,null,null,0,null,"","","",""]
[null,null,null,null,null,null,null,null,0,null,"","","",""]
[null,null,null,null,null,null,null,null,{"$f":"IFERROR(G1831+H1831,\"\")","v":0},null,{"$f":"IFERROR(IF(J1831<>\"\",F1831*J1831,\"\"),\"\")","v":""},{"$f":"IFERROR(IF(J1831<>\"\",G1831*J1831,\"\"),\"\")","v":""},{"$f":"IFERROR(IF(J1831<>\"\",H1831*J1831,\"\"),\"\")","v":""},{"$f":"IFERROR(L1831+M1831,\"\")","v":""}]
[null,null,null,null,null,null,null,null,0,null,"","","",""]
[null,null,null,null,null,null,null,null,0,null,"","","",""]
[null,null,null,null,null,null,null,null,0,null,"","","",""]
[null,null,null,null,null,null,null,null,0,null,"","","",""]
[null,null,null,null,null,null,null,null,0,null,"","","",""]
[null,null,null,null,null,null,null,null,0,null,"","","",""]
[null,null,null,null,null,null,null,null,0,null,"","","",""]
[null,null,null,null,null,null,null,null,0,null,"","","",""]
[null,null,null,null,null,null,null,null,0,null,"","","",""]
[null,null,null,null,null,null,null,null,0,null,"","","",""]
[null,null,null,null,null,null,null,null,0,null,"","","",""]
[null,null,null,null,null,null,null,null,0,null,"","","",""]
[null,null,null,null,null,null,null,null,0,null,"","","",""]
[null,null,null,null,null,null,null,null,0,null,"","","",""]
[null,null,null,null,null,null,null,null,0,null,"","","",""]
[null,null,null,null,null,null,null,null,0,null,"","","",""]
[null,null,null,null,null,null,null,null,0,null,"","","",""]
[null,null,null,null,null,null,null,null,0,null,"","","",""]
[null,null,null,null,null,null,null,null,0,null,"","","",""]
[null,null,null,null,null,null,null,null,0,null,"","","",""]
[null,null,null,null,null,null,null,null,0,null,"","","",""]
[null,null,null,null,null,null,null,null,0,null,"","","",""]
[null,null,null,null,null,null,null,null,0,null,"","","",""]
[null,null,null,null,null,null,null,null,0,null,"","","",""]
[null,null,null,null,null,null,null,null,0,null,"","","",""]
[null,null,null,null,null,null,null,null,0,null,"","","",""]
[null,null,null,null,null,null,null,null,0,null,"","","",""]
[null,null,null,null,null,null,null,null,0,null,"","","",""]
[null,null,null,null,null,null,null,null,0,null,"","","",""]
[null,null,null,null,null,null,null,null,0,null,"","","",""]
[null,null,null,null,null,null,null,null,0,null,"","","",""]
[null,null,null,null,null,null,null,null,0,null,"","","",""]
[null,null,null,null,null,null,null,null,0,null,"","","",""]
[null,null,null,null,null,null,null,null,0,null,"","","",""]
[null,null,null,null,null,null,null,null,0,null,"","","",""]
[null,null,null,null,null,null,null,null,0,null,"","","",""]
[null,null,null,null,null,null,null,null,0,null,"","","",""]
[null,null,null,null,null,null,null,null,0,null,"","","",""]
[null,null,null,null,null,null,null,null,0,null,"","","",""]
[null,null,null,null,null,null,null,null,0,null,"","","",""]
[null,null,null,null,null,null,null,null,0,null,"","","",""]
[null,null,null,null,null,null,null,null,0,null,"","","",""]
[null,null,null,null,null,null,null,null,0,null,"","","",""]
[null,null,null,null,null,null,null,null,0,null,"","","",""]
[null,null,null,null,null,null,null,null,0,null,"","","",""]
[null,null,null,null,null,null,null,null,0,null,"","","",""]
[null,null,null,null,null,null,null,null,0,null,"","","",""]
[null,null,null,null,null,null,null,null,0,null,"","","",""]
[null,null,null,null,null,null,null,null,0,null,"","","",""]
[null,null,null,null,null,null,null,null,0,null,"","","",""]
[null,null,null,null,null,null,null,null,0,null,"","","",""]
[null,null,null,null,null,null,null,null,0,null,"","","",""]
[null,null,null,null,null,null,null,null,0,null,"","","",""]
[null,null,null,null,null,null,null,null,0,null,"","","",""]
[null,null,null,null,null,null,null,null,0,null,"","","",""]
[null,null,null,null,null,null,null,null,0,null,"","","",""]
[null,null,null,null,null,null,null,null,0,null,"","","",""]
[null,null,null,null,null,null,null,null,0,null,"","","",""]
[null,null,null,null,null,null,null,null,0,null,"","","",""]
[null,null,null,null,null,null,null,null,0,null,"","","",""]
[null,null,null,null,null,null,null,null,0,null,"","","",""]
[null,null,null,null,null,null,null,null,0,null,"","","",""]
[null,null,null,null,null,null,null,null,0,null,"","","",""]
[null,null,null,null,null,null,null,null,{"$f":"IFERROR(G1895+H1895,\"\")","v":0},null,{"$f":"IFERROR(IF(J1895<>\"\",F1895*J1895,\"\"),\"\")","v":""},{"$f":"IFERROR(IF(J1895<>\"\",G1895*J1895,\"\"),\"\")","v":""},{"$f":"IFERROR(IF(J1895<>\"\",H1895*J1895,\"\"),\"\")","v":""},{"$f":"IFERROR(L1895+M1895,\"\")","v":""}]
[null,null,null,null,null,null,null,null,0,null,"","","",""]
[null,null,null,null,null,null,null,null,0,null,"","","",""]
[null,null,null,null,null,null,null,null,0,null,"","","",""]
[null,null,null,null,null,null,null,null,0,null,"","","",""]
[null,null,null,null,null,null,null,null,0,null,"","","",""]
[null,null,null,null,null,null,null,null,0,null,"","","",""]
[null,null,null,null,null,null,null,null,0,null,"","","",""]
[null,null,null,null,null,null,null,null,0,null,"","","",""]
[null,null,null,null,null,null,null,null,0,null,"","","",""]
[null,null,null,null,null,null,null,null,0,null,"","","",""]
[null,null,null,null,null,null,null,null,0,null,"","","",""]
[null,null,null,null,null,null,null,null,0,null,"","","",""]
[null,null,null,null,null,null,null,null,0,null,"","","",""]
[null,null,null,null,null,null,null,null,0,null,"","","",""]
[null,null,null,null,null,null,null,null,0,null,"","","",""]
[null,null,null,null,null,null,null,null,0,null,"","","",""]
[null,null,null,null,null,null,null,null,0,null,"","","",""]
[null,null,null,null,null,null,null,null,0,null,"","","",""]
[null,null,null,null,null,null,null,null,0,null,"","","",""]
[null,null,null,null,null,null,null,null,0,null,"","","",""]
[null,null,null,null,null,null,null,null,0,null,"","","",""]
[null,null,null,null,null,null,null,null,0,null,"","","",""]
[null,null,null,null,null,null,null,null,0,null,"","","",""]
[null,null,null,null,null,null,null,null,0,null,"","","",""]
[null,null,null,null,null,null,null,null,0,null,"","","",""]
[null,null,null,null,null,null,null,null,0,null,"","","",""]
[null,null,null,null,null,null,null,null,0,null,"","","",""]
[null,null,null,null,null,null,null,null,0,null,"","","",""]
[null,null,null,null,null,null,null,null,0,null,"","","",""]
[null,null,null,null,null,null,null,null,0,null,"","","",""]
[null,null,null,null,null,null,null,null,0,null,"","","",""]
[null,null,null,null,null,null,null,null,0,null,"","","",""]
[null,null,null,null,null,null,null,null,0,null,"","","",""]
[null,null,null,null,null,null,null,null,0,null,"","","",""]
[null,null,null,null,null,null,null,null,0,null,"","","",""]
[null,null,null,null,null,null,null,null,0,null,"","","",""]
[null,null,null,null,null,null,null,null,0,null,"","","",""]
[null,null,null,null,null,null,null,null,0,null,"","","",""]
[null,null,null,null,null,null,null,null,0,null,"","","",""]
[null,null,null,null,null,null,null,null,0,null,"","","",""]
[null,null,null,null,null,null,null,null,0,null,"","","",""]
[null,null,null,null,null,null,null,null,0,null,"","","",""]
[null,null,null,null,null,null,null,null,0,null,"","","",""]
[null,null,null,null,null,null,null,null,0,null,"","","",""]
[null,null,null,null,null,null,null,null,0,null,"","","",""]
[null,null,null,null,null,null,null,null,0,null,"","","",""]
[null,null,null,null,null,null,null,null,0,null,"","","",""]
[null,null,null,null,null,null,null,null,0,null,"","","",""]
[null,null,null,null,null,null,null,null,0,null,"","","",""]
[null,null,null,null,null,null,null,null,0,null,"","","",""]
[null,null,null,null,null,null,null,null,0,null,"","","",""]
[null,null,null,null,null,null,null,null,0,null,"","","",""]
[null,null,null,null,null,null,null,null,0,null,"","","",""]
[null,null,null,null,null,null,null,null,0,null,"","","",""]
[null,null,null,null,null,null,null,null,0,null,"","","",""]
[null,null,null,null,null,null,null,null,0,null,"","","",""]
[null,null,null,null,null,null,null,null,0,null,"","","",""]
[null,null,null,null,null,null,null,null,0,null,"","","",""]
[null,null,null,null,null,null,null,null,0,null,"","","",""]
[null,null,null,null,null,null,null,null,0,null,"","","",""]
[null,null,null,null,null,null,null,null,0,null,"","","",""]
[null,null,null,null,null,null,null,null,0,null,"","","",""]
[null,null,null,null,null,null,null,null,0,null,"","","",""]
[null,null,null,null,null,null,null,null,{"$f":"IFERROR(G1959+H1959,\"\")","v":0},null,{"$f":"IFERROR(IF(J1959<>\"\",F1959*J1959,\"\"),\"\")","v":""},{"$f":"IFERROR(IF(J1959<>\"\",G1959*J1959,\"\"),\"\")","v":""},{"$f":"IFERROR(IF(J1959<>\"\",H1959*J1959,\"\"),\"\")","v":""},{"$f":"IFERROR(L1959+M1959,\"\")","v":""}]
[null,null,null,null,null,null,null,null,0,null,"","","",""]
[null,null,null,null,null,null,null,null,0,null,"","","",""]
[null,null,null,null,null,null,null,null,0,null,"","","",""]
[null,null,null,null,null,null,null,null,0,null,"","","",""]
[null,null,null,null,null,null,null,null,0,null,"","","",""]
[null,null,null,null,null,null,null,null,0,null,"","","",""]
[null,null,null,null,null,null,null,null,0,null,"","","",""]
[null,null,null,null,null,null,null,null,0,null,"","","",""]
[null,null,null,null,null,null,null,null,0,null,"","","",""]
[null,null,null,null,null,null,null,null,0,null,"","","",""]
[null,null,null,null,null,null,null,null,0,null,"","","",""]
[null,null,null,null,null,null,null,null,0,null,"","","",""]
[null,null,null,null,null,null,null,null,0,null,"","","",""]
[null,null,null,null,null,null,null,null,0,null,"","","",""]
[null,null,null,null,null,null,null,null,0,null,"","","",""]
[null,null,null,null,null,null,null,null,0,null,"","","",""]
[null,null,null,null,null,null,null,null,0,null,"","","",""]
[null,null,null,null,null,null,null,null,0,null,"","","",""]
[null,null,null,null,null,null,null,null,0,null,"","","",""]
[null,null,null,null,null,null,null,null,0,null,"","","",""]
[null,null,null,null,null,null,null,null,0,null,"","","",""]
[null,null,null,null,null,null,null,null,0,null,"","","",""]
[null,null,null,null,null,null,null,null,0,null,"","","",""]
[null,null,null,null,null,null,null,null,0,null,"","","",""]
[null,null,null,null,null,null,null,null,0,null,"","","",""]
[null,null,null,null,null,null,null,null,0,null,"","","",""]
[null,null,null,null,null,null,null,null,0,null,"","","",""]
[null,null,null,null,null,null,null,null,0,null,"","","",""]
[null,null,null,null,null,null,null,null,0,null,"","","",""]
[null,null,null,null,null,null,null,null,0,null,"","","",""]
[null,null,null,null,null,null,null,null,0,null,"","","",""]
[null,null,null,null,null,null,null,null,0,null,"","","",""]
[null,null,null,null,null,null,null,null,0,null,"","","",""]
[null,null,null,null,null,null,null,null,0,null,"","","",""]
[null,null,null,null,null,null,null,null,0,null,"","","",""]
[null,null,null,null,null,null,null,null,0,null,"","","",""]
[null,null,null,null,null,null,null,null,0,null,"","","",""]
[null,null,null,null,null,null,null,null,0,null,"","","",""]
[null,null,null,null,null,null,null,null,0,null,"","","",""]
[null,null,null,null,null,null,null,null,0,null,"","","",""]
[null,null,null,null,null,null,null,null,0,null,"","","",""]
[null,null,null,null,null,null,null,null,0,null,"","","",""]
[null,null,null,null,null,null,null,null,0,null,"","","",""]
[null,null,null,null,null,null,null,null,0,null,"","","",""]
[null,null,null,null,null,null,null,null,0,null,"","","",""]
[null,null,null,null,null,null,null,null,0,null,"","","",""]
[null,null,null,null,null,null,null,null,0,null,"","","",""]
[null,null,null,null,null,null,null,null,0,null,"","","",""]
[null,null,null,null,null,null,null,null,0,null,"","","",""]
[null,null,null,null,null,null,null,null,0,null,"","","",""]
[null,null,null,null,null,null,null,null,0,null,"","","",""]
[null,null,null,null,null,null,null,null,0,null,"","","",""]
[null,null,null,null,null,null,null,null,0,null,"","","",""]
[null,null,null,null,null,null,null,null,0,null,"","","",""]
[null,null,null,null,null,null,null,null,0,null,"","","",""]
[null,null,null,null,null,null,null,null,0,null,"","","",""]
[null,null,null,null,null,null,null,null,0,null,"","","",""]
[null,null,null,null,null,null,null,null,0,null,"","","",""]
[null,null,null,null,null,null,null,null,0,null,"","","",""]
[null,null,null,null,null,null,null,null,0,null,"","","",""]
[null,null,null,null,null,null,null,null,0,null,"","","",""]
[null,null,null,null,null,null,null,null,0,null,"","","",""]
[null,null,null,null,null,null,null,null,0,null,"","","",""]
[null,null,null,null,null,null,null,null,{"$f":"IFERROR(G2023+H2023,\"\")","v":0},null,{"$f":"IFERROR(IF(J2023<>\"\",F2023*J2023,\"\"),\"\")","v":""},{"$f":"IFERROR(IF(J2023<>\"\",G2023*J2023,\"\"),\"\")","v":""},{"$f":"IFERROR(IF(J2023<>\"\",H2023*J2023,\"\"),\"\")","v":""},{"$f":"IFERROR(L2023+M2023,\"\")","v":""}]
[null,null,null,null,null,null,null,null,0,null,"","","",""]
[null,null,null,null,null,null,null,null,0,null,"","","",""]
[null,null,null,null,null,null,null,null,0,null,"","","",""]
[null,null,null,null,null,null,null,null,0,null,"","","",""]
[null,null,null,null,null,null,null,null,0,null,"","","",""]
[null,null,null,null,null,null,null,null,0,null,"","","",""]
[null,null,null,null,null,null,null,null,0,null,"","","",""]
[null,null,null,null,null,null,null,null,0,null,"","","",""]
[null,null,null,null,null,null,null,null,0,null,"","","",""]
[null,null,null,null,null,null,null,null,0,null,"","","",""]
[null,null,null,null,null,null,null,null,0,null,"","","",""]
[null,null,null,null,null,null,null,null,0,null,"","","",""]
[null,null,null,null,null,null,null,null,0,null,"","","",""]
[null,null,null,null,null,null,null,null,0,null,"","","",""]
[null,null,null,null,null,null,null,null,0,null,"","","",""]
[null,null,null,null,null,null,null,null,0,null,"","","",""]
[null,null,null,null,null,null,null,null,0,null,"","","",""]
[null,null,null,null,null,null,null,null,0,null,"","","",""]
[null,null,null,null,null,null,null,null,0,null,"","","",""]
[null,null,null,null,null,null,null,null,0,null,"","","",""]
[null,null,null,null,null,null,null,null,0,null,"","","",""]
[null,null,null,null,null,null,null,null,0,null,"","","",""]
[null,null,null,null,null,null,null,null,0,null,"","","",""]
[null,null,null,null,null,null,null,null,0,null,"","","",""]
[null,null,null,null,null,null,null,null,0,null,"","","",""]
[null,null,null,null,null,null,null,null,0,null,"","","",""]
[null,null,null,null,null,null,null,null,0,null,"","","",""]
[null,null,null,null,null,null,null,null,0,null,"","","",""]
[null,null,null,null,null,null,null,null,0,null,"","","",""]
[null,null,null,null,null,null,null,null,0,null,"","","",""]
[null,null,null,null,null,null,null,null,0,null,"","","",""]
[null,null,null,null,null,null,null,null,0,null,"","","",""]
[null,null,null,null,null,null,null,null,0,null,"","","",""]
[null,null,null,null,null,null,null,null,0,null,"","","",""]
[null,null,null,null,null,null,null,null,0,null,"","","",""]
[null,null,null,null,null,null,null,null,0,null,"","","",""]
[null,null,null,null,null,null,null,null,0,null,"","","",""]
[null,null,null,null,null,null,null,null,0,null,"","","",""]
[null,null,null,null,null,null,null,null,0,null,"","","",""]
[null,null,null,null,null,null,null,null,0,null,"","","",""]
[null,null,null,null,null,null,null,null,0,null,"","","",""]
[null,null,null,null,null,null,null,null,0,null,"","","",""]
[null,null,null,null,null,null,null,null,0,null,"","","",""]
[null,null,null,null,null,null,null,null,0,null,"","","",""]
[null,null,null,null,null,null,null,null,0,null,"","","",""]
[null,null,null,null,null,null,null,null,0,null,"","","",""]
[null,null,null,null,null,null,null,null,0,null,"","","",""]
[null,null,null,null,null,null,null,null,0,null,"","","",""]
[null,null,null,null,null,null,null,null,0,null,"","","",""]
[null,null,null,null,null,null,null,null,0,null,"","","",""]
[null,null,null,null,null,null,null,null,0,null,"","","",""]
[null,null,null,null,null,null,null,null,0,null,"","","",""]
[null,null,null,null,null,null,null,null,0,null,"","","",""]
[null,null,null,null,null,null,null,null,0,null,"","","",""]
[null,null,null,null,null,null,null,null,0,null,"","","",""]
[null,null,null,null,null,null,null,null,0,null,"","","",""]
[null,null,null,null,null,null,null,null,0,null,"","","",""]
[null,null,null,null,null,null,null,null,0,null,"","","",""]
[null,null,null,null,null,null,null,null,0,null,"","","",""]
[null,null,null,null,null,null,null,null,0,null,"","","",""]
[null,null,null,null,null,null,null,null,0,null,"","","",""]
[null,null,null,null,null,null,null,null,0,null,"","","",""]
[null,null,null,null,null,null,null,null,0,null,"","","",""]
[null,null,null,null,null,null,null,null,{"$f":"IFERROR(G2087+H2087,\"\")","v":0},null,{"$f":"IFERROR(IF(J2087<>\"\",F2087*J2087,\"\"),\"\")","v":""},{"$f":"IFERROR(IF(J2087<>\"\",G2087*J2087,\"\"),\"\")","v":""},{"$f":"IFERROR(IF(J2087<>\"\",H2087*J2087,\"\"),\"\")","v":""},{"$f":"IFERROR(L2087+M2087,\"\")","v":""}]
[null,null,null,null,null,null,null,null,0,null,"","","",""]
[null,null,null,null,null,null,null,null,0,null,"","","",""]
[null,null,null,null,null,null,null,null,0,null,"","","",""]
[null,null,null,null,null,null,null,null,0,null,"","","",""]
[null,null,null,null,null,null,null,null,0,null,"","","",""]
[null,null,null,null,null,null,null,null,0,null,"","","",""]
[null,null,null,null,null,null,null,null,0,null,"","","",""]
[null,null,null,null,null,null,null,null,0,null,"","","",""]
[null,null,null,null,null,null,null,null,0,null,"","","",""]
[null,null,null,null,null,null,null,null,0,null,"","","",""]
[null,null,null,null,null,null,null,null,0,null,"","","",""]
[null,null,null,null,null,null,null,null,0,null,"","","",""]
[null,null,null,null,null,null,null,null,0,null,"","","",""]
[null,null,null,null,null,null,null,null,0,null,"","","",""]
[null,null,null,null,null,null,null,null,0,null,"","","",""]
[null,null,null,null,null,null,null,null,0,null,"","","",""]
[null,null,null,null,null,null,null,null,0,null,"","","",""]
[null,null,null,null,null,null,null,null,0,null,"","","",""]
[null,null,null,null,null,null,null,null,0,null,"","","",""]
[null,null,null,null,null,null,null,null,0,null,"","","",""]
[null,null,null,null,null,null,null,null,0,null,"","","",""]
[null,null,null,null,null,null,null,null,0,null,"","","",""]
[null,null,null,null,null,null,null,null,0,null,"","","",""]
[null,null,null,null,null,null,null,null,0,null,"","","",""]
[null,null,null,null,null,null,null,null,0,null,"","","",""]
[null,null,null,null,null,null,null,null,0,null,"","","",""]
[null,null,null,null,null,null,null,null,0,null,"","","",""]
[null,null,null,null,null,null,null,null,0,null,"","","",""]
[null,null,null,null,null,null,null,null,0,null,"","","",""]
[null,null,null,null,null,null,null,null,0,null,"","","",""]
[null,null,null,null,null,null,null,null,0,null,"","","",""]
[null,null,null,null,null,null,null,null,0,null,"","","",""]
[null,null,null,null,null,null,null,null,0,null,"","","",""]
[null,null,null,null,null,null,null,null,0,null,"","","",""]
[null,null,null,null,null,null,null,null,0,null,"","","",""]
[null,null,null,null,null,null,null,null,0,null,"","","",""]
[null,null,null,null,null,null,null,null,0,null,"","","",""]
[null,null,null,null,null,null,null,null,0,null,"","","",""]
[null,null,null,null,null,null,null,null,0,null,"","","",""]
[null,null,null,null,null,null,null,null,0,null,"","","",""]
[null,null,null,null,null,null,null,null,0,null,"","","",""]
[null,null,null,null,null,null,null,null,0,null,"","","",""]
[null,null,null,null,null,null,null,null,0,null,"","","",""]
[null,null,null,null,null,null,null,null,0,null,"","","",""]
[null,null,null,null,null,null,null,null,0,null,"","","",""]
[null,null,null,null,null,null,null,null,0,null,"","","",""]
[null,null,null,null,null,null,null,null,0,null,"","","",""]
[null,null,null,null,null,null,null,null,0,null,"","","",""]
[null,null,null,null,null,null,null,null,0,null,"","","",""]
[null,null,null,null,null,null,null,null,0,null,"","","",""]
[null,null,null,null,null,null,null,null,0,null,"","","",""]
[null,null,null,null,null,null,null,null,0,null,"","","",""]
[null,null,null,null,null,null,null,null,0,null,"","","",""]
[null,null,null,null,null,null,null,null,0,null,"","","",""]
[null,null,null,null,null,null,null,null,0,null,"","","",""]
[null,null,null,null,null,null,null,null,0,null,"","","",""]
[null,null,null,null,null,null,null,null,0,null,"","","",""]
[null,null,null,null,null,null,null,null,0,null,"","","",""]
[null,null,null,null,null,null,null,null,0,null,"","","",""]
[null,null,null,null,null,null,null,null,0,null,"","","",""]
[null,null,null,null,null,null,null,null,0,null,"","","",""]
[null,null,null,null,null,null,null,null,0,null,"","","",""]
[null,null,null,null,null,null,null,null,0,null,"","","",""]
[null,null,null,null,null,null,null,null,{"$f":"IFERROR(G2151+H2151,\"\")","v":0},null,{"$f":"IFERROR(IF(J2151<>\"\",F2151*J2151,\"\"),\"\")","v":""},{"$f":"IFERROR(IF(J2151<>\"\",G2151*J2151,\"\"),\"\")","v":""},{"$f":"IFERROR(IF(J2151<>\"\",H2151*J2151,\"\"),\"\")","v":""},{"$f":"IFERROR(L2151+M2151,\"\")","v":""}]
[null,null,null,null,null,null,null,null,0,null,"","","",""]
[null,null,null,null,null,null,null,null,0,null,"","","",""]
[null,null,null,null,null,null,null,null,0,null,"","","",""]
[null,null,null,null,null,null,null,null,0,null,"","","",""]
[null,null,null,null,null,null,null,null,0,null,"","","",""]
[null,null,null,null,null,null,null,null,0,null,"","","",""]
[null,null,null,null,null,null,null,null,0,null,"","","",""]
[null,null,null,null,null,null,null,null,0,null,"","","",""]
[null,null,null,null,null,null,null,null,0,null,"","","",""]
[null,null,null,null,null,null,null,null,0,null,"","","",""]
[null,null,null,null,null,null,null,null,0,null,"","","",""]
[null,null,null,null,null,null,null,null,0,null,"","","",""]
[null,null,null,null,null,null,null,null,0,null,"","","",""]
[null,null,null,null,null,null,null,null,0,null,"","","",""]
[null,null,null,null,null,null,null,null,0,null,"","","",""]
[null,null,null,null,null,null,null,null,0,null,"","","",""]
[null,null,null,null,null,null,null,null,0,null,"","","",""]
[null,null,null,null,null,null,null,null,0,null,"","","",""]
[null,null,null,null,null,null,null,null,0,null,"","","",""]
[null,null,null,null,null,null,null,null,0,null,"","","",""]
[null,null,null,null,null,null,null,null,0,null,"","","",""]
[null,null,null,null,null,null,null,null,0,null,"","","",""]
[null,null,null,null,null,null,null,null,0,null,"","","",""]
[null,null,null,null,null,null,null,null,0,null,"","","",""]
[null,null,null,null,null,null,null,null,0,null,"","","",""]
[null,null,null,null,null,null,null,null,0,null,"","","",""]
[null,null,null,null,null,null,null,null,0,null,"","","",""]
[null,null,null,null,null,null,null,null,0,null,"","","",""]
[null,null,null,null,null,null,null,null,0,null,"","","",""]
[null,null,null,null,null,null,null,null,0,null,"","","",""]
[null,null,null,null,null,null,null,null,0,null,"","","",""]
[null,null,null,null,null,null,null,null,0,null,"","","",""]
[null,null,null,null,null,null,null,null,0,null,"","","",""]
[null,null,null,null,null,null,null,null,0,null,"","","",""]
[null,null,null,null,null,null,null,null,0,null,"","","",""]
[null,null,null,null,null,null,null,null,0,null,"","","",""]
[null,null,null,null,null,null,null,null,0,null,"","","",""]
[null,null,null,null,null,null,null,null,0,null,"","","",""]
[null,null,null,null,null,null,null,null,0,null,"","","",""]
[null,null,null,null,null,null,null,null,0,null,"","","",""]
[null,null,null,null,null,null,null,null,0,null,"","","",""]
[null,null,null,null,null,null,null,null,0,null,"","","",""]
[null,null,null,null,null,null,null,null,0,null,"","","",""]
[null,null,null,null,null,null,null,null,0,null,"","","",""]
[null,null,null,null,null,null,null,null,0,null,"","","",""]
[null,null,null,null,null,null,null,null,0,null,"","","",""]
[null,null,null,null,null,null,null,null,0,null,"","","",""]
[null,null,null,null,null,null,null,null,0,null,"","","",""]
[null,null,null,null,null,null,null,null,0,null,"","","",""]
[null,null,null,null,null,null,null,null,0,null,"","","",""]
[null,null,null,null,null,null,null,null,0,null,"","","",""]
[null,null,null,null,null,null,null,null,0,null,"","","",""]
[null,null,null,null,null,null,null,null,0,null,"","","",""]
[null,null,null,null,null,null,null,null,0,null,"","","",""]
[null,null,null,null,null,null,null,null,0,null,"","","",""]
[null,null,null,null,null,null,null,null,0,null,"","","",""]
[null,null,null,null,null,null,null,null,0,null,"","","",""]
[null,null,null,null,null,null,null,null,0,null,"","","",""]
[null,null,null,null,null,null,null,null,0,null,"","","",""]
[null,null,null,null,null,null,null,null,0,null,"","","",""]
[null,null,null,null,null,null,null,null,0,null,"","","",""]
[null,null,null,null,null,null,null,null,0,null,"","","",""]
[null,null,null,null,null,null,null,null,0,null,"","","",""]
[null,null,null,null,null,null,null,null,{"$f":"IFERROR(G2215+H2215,\"\")","v":0},null,{"$f":"IFERROR(IF(J2215<>\"\",F2215*J2215,\"\"),\"\")","v":""},{"$f":"IFERROR(IF(J2215<>\"\",G2215*J2215,\"\"),\"\")","v":""},{"$f":"IFERROR(IF(J2215<>\"\",H2215*J2215,\"\"),\"\")","v":""},{"$f":"IFERROR(L2215+M2215,\"\")","v":""}]
[null,null,null,null,null,null,null,null,0,null,"","","",""]
[null,null,null,null,null,null,null,null,0,null,"","","",""]
[null,null,null,null,null,null,null,null,0,null,"","","",""]
[null,null,null,null,null,null,null,null,0,null,"","","",""]
[null,null,null,null,null,null,null,null,0,null,"","","",""]
[null,null,null,null,null,null,null,null,0,null,"","","",""]
[null,null,null,null,null,null,null,null,0,null,"","","",""]
[null,null,null,null,null,null,null,null,0,null,"","","",""]
[null,null,null,null,null,null,null,null,0,null,"","","",""]
[null,null,null,null,null,null,null,null,0,null,"","","",""]
[null,null,null,null,null,null,null,null,0,null,"","","",""]
[null,null,null,null,null,null,null,null,0,null,"","","",""]
[null,null,null,null,null,null,null,null,0,null,"","","",""]
[null,null,null,null,null,null,null,null,0,null,"","","",""]
[null,null,null,null,null,null,null,null,0,null,"","","",""]
[null,null,null,null,null,null,null,null,0,null,"","","",""]
[null,null,null,null,null,null,null,null,0,null,"","","",""]
[null,null,null,null,null,null,null,null,0,null,"","","",""]
[null,null,null,null,null,null,null,null,0,null,"","","",""]
[null,null,null,null,null,null,null,null,0,null,"","","",""]
[null,null,null,null,null,null,null,null,0,null,"","","",""]
[null,null,null,null,null,null,null,null,0,null,"","","",""]
[null,null,null,null,null,null,null,null,0,null,"","","",""]
[null,null,null,null,null,null,null,null,0,null,"","","",""]
[null,null,null,null,null,null,null,null,0,null,"","","",""]
[null,null,null,null,null,null,null,null,0,null,"","","",""]
[null,null,null,null,null,null,null,null,0,null,"","","",""]
[null,null,null,null,null,null,null,null,0,null,"","","",""]
[null,null,null,null,null,null,null,null,0,null,"","","",""]
[null,null,null,null,null,null,null,null,0,null,"","","",""]
[null,null,null,null,null,null,null,null,0,null,"","","",""]
[null,null,null,null,null,null,null,null,0,null,"","","",""]
[null,null,null,null,null,null,null,null,0,null,"","","",""]
[null,null,null,null,null,null,null,null,0,null,"","","",""]
[null,null,null,null,null,null,null,null,0,null,"","","",""]
[null,null,null,null,null,null,null,null,0,null,"","","",""]
[null,null,null,null,null,null,null,null,0,null,"","","",""]
[null,null,null,null,null,null,null,null,0,null,"","","",""]
[null,null,null,null,null,null,null,null,0,null,"","","",""]
[null,null,null,null,null,null,null,null,0,null,"","","",""]
[null,null,null,null,null,null,null,null,0,null,"","","",""]
[null,null,null,null,null,null,null,null,0,null,"","","",""]
[null,null,null,null,null,null,null,null,0,null,"","","",""]
[null,null,null,null,null,null,null,null,0,null,"","","",""]
[null,null,null,null,null,null,null,null,0,null,"","","",""]
[null,null,null,null,null,null,null,null,0,null,"","","",""]
[null,null,null,null,null,null,null,null,0,null,"","","",""]
[null,null,null,null,null,null,null,null,0,null,"","","",""]
[null,null,null,null,null,null,null,null,0,null,"","","",""]
[null,null,null,null,null,null,null,null,0,null,"","","",""]
[null,null,null,null,null,null,null,null,0,null,"","","",""]
[null,null,null,null,null,null,null,null,0,null,"","","",""]
[null,null,null,null,null,null,null,null,0,null,"","","",""]
[null,null,null,null,null,null,null,null,0,null,"","","",""]
[null,null,null,null,null,null,null,null,0,null,"","","",""]
[null,null,null,null,null,null,null,null,0,null,"","","",""]
[null,null,null,null,null,null,null,null,0,null,"","","",""]
[null,null,null,null,null,null,null,null,0,null,"","","",""]
[null,null,null,null,null,null,null,null,0,null,"","","",""]
[null,null,null,null,null,null,null,null,0,null,"","","",""]
[null,null,null,null,null,null,null,null,0,null,"","","",""]
[null,null,null,null,null,null,null,null,0,null,"","","",""]
[null,null,null,null,null,null,null,null,0,null,"","","",""]
[null,null,null,null,null,null,null,null,{"$f":"IFERROR(G2279+H2279,\"\")","v":0},null,{"$f":"IFERROR(IF(J2279<>\"\",F2279*J2279,\"\"),\"\")","v":""},{"$f":"IFERROR(IF(J2279<>\"\",G2279*J2279,\"\"),\"\")","v":""},{"$f":"IFERROR(IF(J2279<>\"\",H2279*J2279,\"\"),\"\")","v":""},{"$f":"IFERROR(L2279+M2279,\"\")","v":""}]
[null,null,null,null,null,null,null,null,0,null,"","","",""]
[null,null,null,null,null,null,null,null,0,null,"","","",""]
[null,null,null,null,null,null,null,null,0,null,"","","",""]
[null,null,null,null,null,null,null,null,0,null,"","","",""]
[null,null,null,null,null,null,null,null,0,null,"","","",""]
[null,null,null,null,null,null,null,null,0,null,"","","",""]
[null,null,null,null,null,null,null,null,0,null,"","","",""]
[null,null,null,null,null,null,null,null,0,null,"","","",""]
[null,null,null,null,null,null,null,null,0,null,"","","",""]
[null,null,null,null,null,null,null,null,0,null,"","","",""]
[null,null,null,null,null,null,null,null,0,null,"","","",""]
[null,null,null,null,null,null,null,null,0,null,"","","",""]
[null,null,null,null,null,null,null,null,0,null,"","","",""]
[null,null,null,null,null,null,null,null,0,null,"","","",""]
[null,null,null,null,null,null,null,null,0,null,"","","",""]
[null,null,null,null,null,null,null,null,0,null,"","","",""]
[null,null,null,null,null,null,null,null,0,null,"","","",""]
[null,null,null,null,null,null,null,null,0,null,"","","",""]
[null,null,null,null,null,null,null,null,0,null,"","","",""]
[null,null,null,null,null,null,null,null,0,null,"","","",""]
[null,null,null,null,null,null,null,null,0,null,"","","",""]
[null,null,null,null,null,null,null,null,0,null,"","","",""]
[null,null,null,null,null,null,null,null,0,null,"","","",""]
[null,null,null,null,null,null,null,null,0,null,"","","",""]
[null,null,null,null,null,null,null,null,0,null,"","","",""]
[null,null,null,null,null,null,null,null,0,null,"","","",""]
[null,null,null,null,null,null,null,null,0,null,"","","",""]
[null,null,null,null,null,null,null,null,0,null,"","","",""]
[null,null,null,null,null,null,null,null,0,null,"","","",""]
[null,null,null,null,null,null,null,null,0,null,"","","",""]
[null,null,null,null,null,null,null,null,0,null,"","","",""]
[null,null,null,null,null,null,null,null,0,null,"","","",""]
[null,null,null,null,null,null,null,null,0,null,"","","",""]
[null,null,null,null,null,null,null,null,0,null,"","","",""]
[null,null,null,null,null,null,null,null,0,null,"","","",""]
[null,null,null,null,null,null,null,null,0,null,"","","",""]
[null,null,null,null,null,null,null,null,0,null,"","","",""]
[null,null,null,null,null,null,null,null,0,null,"","","",""]
[null,null,null,null,null,null,null,null,0,null,"","","",""]
[null,null,null,null,null,null,null,null,0,null,"","","",""]
[null,null,null,null,null,null,null,null,0,null,"","","",""]
[null,null,null,null,null,null,null,null,0,null,"","","",""]
[null,null,null,null,null,null,null,null,0,null,"","","",""]
[null,null,null,null,null,null,null,null,0,null,"","","",""]
[null,null,null,null,null,null,null,null,0,null,"","","",""]
[null,null,null,null,null,null,null,null,0,null,"","","",""]
[null,null,null,null,null,null,null,null,0,null,"","","",""]
[null,null,null,null,null,null,null,null,0,null,"","","",""]
[null,null,null,null,null,null,null,null,0,null,"","","",""]
[null,null,null,null,null,null,null,null,0,null,"","","",""]
[null,null,null,null,null,null,null,null,0,null,"","","",""]
[null,null,null,null,null,null,null,null,0,null,"","","",""]
[null,null,null,null,null,null,null,null,0,null,"","","",""]
[null,null,null,null,null,null,null,null,0,null,"","","",""]
[null,null,null,null,null,null,null,null,0,null,"","","",""]
[null,null,null,null,null,null,null,null,0,null,"","","",""]
[null,null,null,null,null,null,null,null,0,null,"","","",""]
[null,null,null,null,null,null,null,null,0,null,"","","",""]
[null,null,null,null,null,null,null,null,0,null,"","","",""]
[null,null,null,null,null,null,null,null,0,null,"","","",""]
[null,null,null,null,null,null,null,null,0,null,"","","",""]
[null,null,null,null,null,null,null,null,0,null,"","","",""]
[null,null,null,null,null,null,null,null,0,null,"","","",""]
[null,null,null,null,null,null,null,null,{"$f":"IFERROR(G2343+H2343,\"\")","v":0},null,{"$f":"IFERROR(IF(J2343<>\"\",F2343*J2343,\"\"),\"\")","v":""},{"$f":"IFERROR(IF(J2343<>\"\",G2343*J2343,\"\"),\"\")","v":""},{"$f":"IFERROR(IF(J2343<>\"\",H2343*J2343,\"\"),\"\")","v":""},{"$f":"IFERROR(L2343+M2343,\"\")","v":""}]
[null,null,null,null,null,null,null,null,0,null,"","","",""]
[null,null,null,null,null,null,null,null,0,null,"","","",""]
[null,null,null,null,null,null,null,null,0,null,"","","",""]
[null,null,null,null,null,null,null,null,0,null,"","","",""]
[null,null,null,null,null,null,null,null,0,null,"","","",""]
[null,null,null,null,null,null,null,null,0,null,"","","",""]
[null,null,null,null,null,null,null,null,0,null,"","","",""]
[null,null,null,null,null,null,null,null,0,null,"","","",""]
[null,null,null,null,null,null,null,null,0,null,"","","",""]
[null,null,null,null,null,null,null,null,0,null,"","","",""]
[null,null,null,null,null,null,null,null,0,null,"","","",""]
[null,null,null,null,null,null,null,null,0,null,"","","",""]
[null,null,null,null,null,null,null,null,0,null,"","","",""]
[null,null,null,null,null,null,null,null,0,null,"","","",""]
[null,null,null,null,null,null,null,null,0,null,"","","",""]
[null,null,null,null,null,null,null,null,0,null,"","","",""]
[null,null,null,null,null,null,null,null,0,null,"","","",""]
[null,null,null,null,null,null,null,null,0,null,"","","",""]
[null,null,null,null,null,null,null,null,0,null,"","","",""]
[null,null,null,null,null,null,null,null,0,null,"","","",""]
[null,null,null,null,null,null,null,null,0,null,"","","",""]
[null,null,null,null,null,null,null,null,0,null,"","","",""]
[null,null,null,null,null,null,null,null,0,null,"","","",""]
[null,null,null,null,null,null,null,null,0,null,"","","",""]
[null,null,null,null,null,null,null,null,0,null,"","","",""]
[null,null,null,null,null,null,null,null,0,null,"","","",""]
[null,null,null,null,null,null,null,null,0,null,"","","",""]
[null,null,null,null,null,null,null,null,0,null,"","","",""]
[null,null,null,null,null,null,null,null,0,null,"","","",""]
[null,null,null,null,null,null,null,null,0,null,"","","",""]
[null,null,null,null,null,null,null,null,0,null,"","","",""]
[null,null,null,null,null,null,null,null,0,null,"","","",""]
[null,null,null,null,null,null,null,null,0,null,"","","",""]
[null,null,null,null,null,null,null,null,0,null,"","","",""]
[null,null,null,null,null,null,null,null,0,null,"","","",""]
[null,null,null,null,null,null,null,null,0,null,"","","",""]
[null,null,null,null,null,null,null,null,0,null,"","","",""]
[null,null,null,null,null,null,null,null,0,null,"","","",""]
[null,null,null,null,null,null,null,null,0,null,"","","",""]
[null,null,null,null,null,null,null,null,0,null,"","","",""]
[null,null,null,null,null,null,null,null,0,null,"","","",""]
[null,null,null,null,null,null,null,null,0,null,"","","",""]
[null,null,null,null,null,null,null,null,0,null,"","","",""]
[null,null,null,null,null,null,null,null,0,null,"","","",""]
[null,null,null,null,null,null,null,null,0,null,"","","",""]
[null,null,null,null,null,null,null,null,0,null,"","","",""]
[null,null,null,null,null,null,null,null,0,null,"","","",""]
[null,null,null,null,null,null,null,null,0,null,"","","",""]
[null,null,null,null,null,null,null,null,0,null,"","","",""]
[null,null,null,null,null,null,null,null,0,null,"","","",""]
[null,null,null,null,null,null,null,null,0,null,"","","",""]
[null,null,null,null,null,null,null,null,0,null,"","","",""]
[null,null,null,null,null,null,null,null,0,null,"","","",""]
[null,null,null,null,null,null,null,null,0,null,"","","",""]
[null,null,null,null,null,null,null,null,0,null,"","","",""]
[null,null,null,null,null,null,null,null,0,null,"","","",""]
[null,null,null,null,null,null,null,null,0,null,"","","",""]
[null,null,null,null,null,null,null,null,0,null,"","","",""]
[null,null,null,null,null,null,null,null,0,null,"","","",""]
[null,null,null,null,null,null,null,null,0,null,"","","",""]
[null,null,null,null,null,null,null,null,0,null,"","","",""]
[null,null,null,null,null,null,null,null,0,null,"","","",""]
[null,null,null,null,null,null,null,null,0,null,"","","",""]
[null,null,null,null,null,null,null,null,{"$f":"IFERROR(G2407+H2407,\"\")","v":0},null,{"$f":"IFERROR(IF(J2407<>\"\",F2407*J2407,\"\"),\"\")","v":""},{"$f":"IFERROR(IF(J2407<>\"\",G2407*J2407,\"\"),\"\")","v":""},{"$f":"IFERROR(IF(J2407<>\"\",H2407*J2407,\"\"),\"\")","v":""},{"$f":"IFERROR(L2407+M2407,\"\")","v":""}]
[null,null,null,null,null,null,null,null,0,null,"","","",""]
[null,null,null,null,null,null,null,null,0,null,"","","",""]
[null,null,null,null,null,null,null,null,0,null,"","","",""]
[null,null,null,null,null,null,null,null,0,null,"","","",""]
[null,null,null,null,null,null,null,null,0,null,"","","",""]
[null,null,null,null,null,null,null,null,0,null,"","","",""]
[null,null,null,null,null,null,null,null,0,null,"","","",""]
[null,null,null,null,null,null,null,null,0,null,"","","",""]
[null,null,null,null,null,null,null,null,0,null,"","","",""]
[null,null,null,null,null,null,null,null,0,null,"","","",""]
[null,null,null,null,null,null,null,null,0,null,"","","",""]
[null,null,null,null,null,null,null,null,0,null,"","","",""]
[null,null,null,null,null,null,null,null,0,null,"","","",""]
[null,null,null,null,null,null,null,null,0,null,"","","",""]
[null,null,null,null,null,null,null,null,0,null,"","","",""]
[null,null,null,null,null,null,null,null,0,null,"","","",""]
[null,null,null,null,null,null,null,null,0,null,"","","",""]
[null,null,null,null,null,null,null,null,0,null,"","","",""]
[null,null,null,null,null,null,null,null,0,null,"","","",""]
[null,null,null,null,null,null,null,null,0,null,"","","",""]
[null,null,null,null,null,null,null,null,0,null,"","","",""]
[null,null,null,null,null,null,null,null,0,null,"","","",""]
[null,null,null,null,null,null,null,null,0,null,"","","",""]
[null,null,null,null,null,null,null,null,0,null,"","","",""]
[null,null,null,null,null,null,null,null,0,null,"","","",""]
[null,null,null,null,null,null,null,null,0,null,"","","",""]
[null,null,null,null,null,null,null,null,0,null,"","","",""]
[null,null,null,null,null,null,null,null,0,null,"","","",""]
[null,null,null,null,null,null,null,null,0,null,"","","",""]
[null,null,null,null,null,null,null,null,0,null,"","","",""]
[null,null,null,null,null,null,null,null,0,null,"","","",""]
[null,null,null,null,null,null,null,null,0,null,"","","",""]
[null,null,null,null,null,null,null,null,0,null,"","","",""]
[null,null,null,null,null,null,null,null,0,null,"","","",""]
[null,null,null,null,null,null,null,null,0,null,"","","",""]
[null,null,null,null,null,null,null,null,0,null,"","","",""]
[null,null,null,null,null,null,null,null,0,null,"","","",""]
[null,null,null,null,null,null,null,null,0,null,"","","",""]
[null,null,null,null,null,null,null,null,0,null,"","","",""]
[null,null,null,null,null,null,null,null,0,null,"","","",""]
[null,null,null,null,null,null,null,null,0,null,"","","",""]
[null,null,null,null,null,null,null,null,0,null,"","","",""]
[null,null,null,null,null,null,null,null,0,null,"","","",""]
[null,null,null,null,null,null,null,null,0,null,"","","",""]
[null,null,null,null,null,null,null,null,0,null,"","","",""]
[null,null,null,null,null,null,null,null,0,null,"","","",""]
[null,null,null,null,null,null,null,null,0,null,"","","",""]
[null,null,null,null,null,null,null,null,0,null,"","","",""]
[null,null,null,null,null,null,null,null,0,null,"","","",""]
[null,null,null,null,null,null,null,null,0,null,"","","",""]
[null,null,null,null,null,null,null,null,0,null,"","","",""]
[null,null,null,null,null,null,null,null,0,null,"","","",""]
[null,null,null,null,null,null,null,null,0,null,"","","",""]
[null,null,null,null,null,null,null,null,0,null,"","","",""]
[null,null,null,null,null,null,null,null,0,null,"","","",""]
[null,null,null,null,null,null,null,null,0,null,"","","",""]
[null,null,null,null,null,null,null,null,0,null,"","","",""]
[null,null,null,null,null,null,null,null,0,null,"","","",""]
[null,null,null,null,null,null,null,null,0,null,"","","",""]
[null,null,null,null,null,null,null,null,0,null,"","","",""]
[null,null,null,null,null,null,null,null,0,null,"","","",""]
[null,null,null,null,null,null,null,null,0,null,"","","",""]
[null,null,null,null,null,null,null,null,0,null,"","","",""]
[null,null,null,null,null,null,null,null,{"$f":"IFERROR(G2471+H2471,\"\")","v":0},null,{"$f":"IFERROR(IF(J2471<>\"\",F2471*J2471,\"\"),\"\")","v":""},{"$f":"IFERROR(IF(J2471<>\"\",G2471*J2471,\"\"),\"\")","v":""},{"$f":"IFERROR(IF(J2471<>\"\",H2471*J2471,\"\"),\"\")","v":""},{"$f":"IFERROR(L2471+M2471,\"\")","v":""}]
[null,null,null,null,null,null,null,null,0,null,"","","",""]
[null,null,null,null,null,null,null,null,0,null,"","","",""]
[null,null,null,null,null,null,null,null,0,null,"","","",""]
[null,null,null,null,null,null,null,null,0,null,"","","",""]
[null,null,null,null,null,null,null,null,0,null,"","","",""]
[null,null,null,null,null,null,null,null,0,null,"","","",""]
[null,null,null,null,null,null,null,null,0,null,"","","",""]
[null,null,null,null,null,null,null,null,0,null,"","","",""]
[null,null,null,null,null,null,null,null,0,null,"","","",""]
[null,null,null,null,null,null,null,null,0,null,"","","",""]
[null,null,null,null,null,null,null,null,0,null,"","","",""]
[null,null,null,null,null,null,null,null,0,null,"","","",""]
[null,null,null,null,null,null,null,null,0,null,"","","",""]
[null,null,null,null,null,null,null,null,0,null,"","","",""]
[null,null,null,null,null,null,null,null,0,null,"","","",""]
[null,null,null,null,null,null,null,null,0,null,"","","",""]
[null,null,null,null,null,null,null,null,0,null,"","","",""]
[null,null,null,null,null,null,null,null,0,null,"","","",""]
[null,null,null,null,null,null,null,null,0,null,"","","",""]
[null,null,null,null,null,null,null,null,0,null,"","","",""]
[null,null,null,null,null,null,null,null,0,null,"","","",""]
[null,null,null,null,null,null,null,null,0,null,"","","",""]
[null,null,null,null,null,null,null,null,0,null,"","","",""]
[null,null,null,null,null,null,null,null,0,null,"","","",""]
[null,null,null,null,null,null,null,null,0,null,"","","",""]
[null,null,null,null,null,null,null,null,0,null,"","","",""]
[null,null,null,null,null,null,null,null,0,null,"","","",""]
[null,null,null,null,null,null,null,null,0,null,"","","",""]
[null,null,null,null,null,null,null,null,0,null,"","","",""]
[null,null,null,null,null,null,null,null,0,null,"","","",""]
[null,null,null,null,null,null,null,null,0,null,"","","",""]
[null,null,null,null,null,null,null,null,0,null,"","","",""]
[null,null,null,null,null,null,null,null,0,null,"","","",""]
[null,null,null,null,null,null,null,null,0,null,"","","",""]
[null,null,null,null,null,null,null,null,0,null,"","","",""]
[null,null,null,null,null,null,null,null,0,null,"","","",""]
[null,null,null,null,null,null,null,null,0,null,"","","",""]
[null,null,null,null,null,null,null,null,0,null,"","","",""]
[null,null,null,null,null,null,null,null,0,null,"","","",""]
[null,null,null,null,null,null,null,null,0,null,"","","",""]
[null,null,null,null,null,null,null,null,0,null,"","","",""]
[null,null,null,null,null,null,null,null,0,null,"","","",""]
[null,null,null,null,null,null,null,null,0,null,"","","",""]
[null,null,null,null,null,null,null,null,0,null,"","","",""]
[null,null,null,null,null,null,null,null,0,null,"","","",""]
[null,null,null,null,null,null,null,null,0,null,"","","",""]
[null,null,null,null,null,null,null,null,0,null,"","","",""]
[null,null,null,null,null,null,null,null,0,null,"","","",""]
[null,null,null,null,null,null,null,null,0,null,"","","",""]
[null,null,null,null,null,null,null,null,0,null,"","","",""]
[null,null,null,null,null,null,null,null,0,null,"","","",""]
[null,null,null,null,null,null,null,null,0,null,"","","",""]
[null,null,null,null,null,null,null,null,0,null,"","","",""]
[null,null,null,null,null,null,null,null,0,null,"","","",""]
[null,null,null,null,null,null,null,null,0,null,"","","",""]
[null,null,null,null,null,null,null,null,0,null,"","","",""]
[null,null,null,null,null,null,null,null,0,null,"","","",""]
[null,null,null,null,null,null,null,null,0,null,"","","",""]
[null,null,null,null,null,null,null,null,0,null,"","","",""]
[null,null,null,null,null,null,null,null,0,null,"","","",""]
[null,null,null,null,null,null,null,null,0,null,"","","",""]
[null,null,null,null,null,null,null,null,0,null,"","","",""]
[null,null,null,null,null,null,null,null,0,null,"","","",""]
[null,null,null,null,null,null,null,null,{"$f":"IFERROR(G2535+H2535,\"\")","v":0},null,{"$f":"IFERROR(IF(J2535<>\"\",F2535*J2535,\"\"),\"\")","v":""},{"$f":"IFERROR(IF(J2535<>\"\",G2535*J2535,\"\"),\"\")","v":""},{"$f":"IFERROR(IF(J2535<>\"\",H2535*J2535,\"\"),\"\")","v":""},{"$f":"IFERROR(L2535+M2535,\"\")","v":""}]
[null,null,null,null,null,null,null,null,0,null,"","","",""]
[null,null,null,null,null,null,null,null,0,null,"","","",""]
[null,null,null,null,null,null,null,null,0,null,"","","",""]
[null,null,null,null,null,null,null,null,0,null,"","","",""]
[null,null,null,null,null,null,null,null,0,null,"","","",""]
[null,null,null,null,null,null,null,null,0,null,"","","",""]
[null,null,null,null,null,null,null,null,0,null,"","","",""]
[null,null,null,null,null,null,null,null,0,null,"","","",""]
[null,null,null,null,null,null,null,null,0,null,"","","",""]
[null,null,null,null,null,null,null,null,0,null,"","","",""]
[null,null,null,null,null,null,null,null,0,null,"","","",""]
[null,null,null,null,null,null,null,null,0,null,"","","",""]
[null,null,null,null,null,null,null,null,0,null,"","","",""]
[null,null,null,null,null,null,null,null,0,null,"","","",""]
[null,null,null,null,null,null,null,null,0,null,"","","",""]
[null,null,null,null,null,null,null,null,0,null,"","","",""]
[null,null,null,null,null,null,null,null,0,null,"","","",""]
[null,null,null,null,null,null,null,null,0,null,"","","",""]
[null,null,null,null,null,null,null,null,0,null,"","","",""]
[null,null,null,null,null,null,null,null,0,null,"","","",""]
[null,null,null,null,null,null,null,null,0,null,"","","",""]
[null,null,null,null,null,null,null,null,0,null,"","","",""]
[null,null,null,null,null,null,null,null,0,null,"","","",""]
[null,null,null,null,null,null,null,null,0,null,"","","",""]
[null,null,null,null,null,null,null,null,0,null,"","","",""]
[null,null,null,null,null,null,null,null,0,null,"","","",""]
[null,null,null,null,null,null,null,null,0,null,"","","",""]
[null,null,null,null,null,null,null,null,0,null,"","","",""]
[null,null,null,null,null,null,null,null,0,null,"","","",""]
[null,null,null,null,null,null,null,null,0,null,"","","",""]
[null,null,null,null,null,null,null,null,0,null,"","","",""]
[null,null,null,null,null,null,null,null,0,null,"","","",""]
[null,null,null,null,null,null,null,null,0,null,"","","",""]
[null,null,null,null,null,null,null,null,0,null,"","","",""]
[null,null,null,null,null,null,null,null,0,null,"","","",""]
[null,null,null,null,null,null,null,null,0,null,"","","",""]
[null,null,null,null,null,null,null,null,0,null,"","","",""]
[null,null,null,null,null,null,null,null,0,null,"","","",""]
[null,null,null,null,null,null,null,null,0,null,"","","",""]
[null,null,null,null,null,null,null,null,0,null,"","","",""]
[null,null,null,null,null,null,null,null,0,null,"","","",""]
[null,null,null,null,null,null,null,null,0,null,"","","",""]
[null,null,null,null,null,null,null,null,0,null,"","","",""]
[null,null,null,null,null,null,null,null,0,null,"","","",""]
[null,null,null,null,null,null,null,null,0,null,"","","",""]
[null,null,null,null,null,null,null,null,0,null,"","","",""]
[null,null,null,null,null,null,null,null,0,null,"","","",""]
[null,null,null,null,null,null,null,null,0,null,"","","",""]
[null,null,null,null,null,null,null,null,0,null,"","","",""]
[null,null,null,null,null,null,null,null,0,null,"","","",""]
[null,null,null,null,null,null,null,null,0,null,"","","",""]
[null,null,null,null,null,null,null,null,0,null,"","","",""]
[null,null,null,null,null,null,null,null,0,null,"","","",""]
[null,null,null,null,null,null,null,null,0,null,"","","",""]
[null,null,null,null,null,null,null,null,0,null,"","","",""]
[null,null,null,null,null,null,null,null,0,null,"","","",""]
[null,null,null,null,null,null,null,null,0,null,"","","",""]
[null,null,null,null,null,null,null,null,0,null,"","","",""]
[null,null,null,null,null,null,null,null,0,null,"","","",""]
[null,null,null,null,null,null,null,null,0,null,"","","",""]
[null,null,null,null,null,null,null,null,0,null,"","","",""]
[null,null,null,null,null,null,null,null,0,null,"","","",""]
[null,null,null,null,null,null,null,null,0,null,"","","",""]
[null,null,null,null,null,null,null,null,{"$f":"IFERROR(G2599+H2599,\"\")","v":0},null,{"$f":"IFERROR(IF(J2599<>\"\",F2599*J2599,\"\"),\"\")","v":""},{"$f":"IFERROR(IF(J2599<>\"\",G2599*J2599,\"\"),\"\")","v":""},{"$f":"IFERROR(IF(J2599<>\"\",H2599*J2599,\"\"),\"\")","v":""},{"$f":"IFERROR(L2599+M2599,\"\")","v":""}]
[null,null,null,null,null,null,null,null,0,null,"","","",""]
[null,null,null,null,null,null,null,null,0,null,"","","",""]
[null,null,null,null,null,null,null,null,0,null,"","","",""]
[null,null,null,null,null,null,null,null,0,null,"","","",""]
[null,null,null,null,null,null,null,null,0,null,"","","",""]
[null,null,null,null,null,null,null,null,0,null,"","","",""]
[null,null,null,null,null,null,null,null,0,null,"","","",""]
[null,null,null,null,null,null,null,null,0,null,"","","",""]
[null,null,null,null,null,null,null,null,0,null,"","","",""]
[null,null,null,null,null,null,null,null,0,null,"","","",""]
[null,null,null,null,null,null,null,null,0,null,"","","",""]
[null,null,null,null,null,null,null,null,0,null,"","","",""]
[null,null,null,null,null,null,null,null,0,null,"","","",""]
[null,null,null,null,null,null,null,null,0,null,"","","",""]
[null,null,null,null,null,null,null,null,0,null,"","","",""]
[null,null,null,null,null,null,null,null,0,null,"","","",""]
[null,null,null,null,null,null,null,null,0,null,"","","",""]
[null,null,null,null,null,null,null,null,0,null,"","","",""]
[null,null,null,null,null,null,null,null,0,null,"","","",""]
[null,null,null,null,null,null,null,null,0,null,"","","",""]
[null,null,null,null,null,null,null,null,0,null,"","","",""]
[null,null,null,null,null,null,null,null,0,null,"","","",""]
[null,null,null,null,null,null,null,null,0,null,"","","",""]
[null,null,null,null,null,null,null,null,0,null,"","","",""]
[null,null,null,null,null,null,null,null,0,null,"","","",""]
[null,null,null,null,null,null,null,null,0,null,"","","",""]
[null,null,null,null,null,null,null,null,0,null,"","","",""]
[null,null,null,null,null,null,null,null,0,null,"","","",""]
[null,null,null,null,null,null,null,null,0,null,"","","",""]
[null,null,null,null,null,null,null,null,0,null,"","","",""]
[null,null,null,null,null,null,null,null,0,null,"","","",""]
[null,null,null,null,null,null,null,null,0,null,"","","",""]
[null,null,null,null,null,null,null,null,0,null,"","","",""]
[null,null,null,null,null,null,null,null,0,null,"","","",""]
[null,null,null,null,null,null,null,null,0,null,"","","",""]
[null,null,null,null,null,null,null,null,0,null,"","","",""]
[null,null,null,null,null,null,null,null,0,null,"","","",""]
[null,null,null,null,null,null,null,null,0,null,"","","",""]
[null,null,null,null,null,null,null,null,0,null,"","","",""]
[null,null,null,null,null,null,null,null,0,null,"","","",""]
[null,null,null,null,null,null,null,null,0,null,"","","",""]
[null,null,null,null,null,null,null,null,0,null,"","","",""]
[null,null,null,null,null,null,null,null,0,null,"","","",""]
[null,null,null,null,null,null,null,null,0,null,"","","",""]
[null,null,null,null,null,null,null,null,0,null,"","","",""]
[null,null,null,null,null,null,null,null,0,null,"","","",""]
[null,null,null,null,null,null,null,null,0,null,"","","",""]
[null,null,null,null,null,null,null,null,0,null,"","","",""]
[null,null,null,null,null,null,null,null,0,null,"","","",""]
[null,null,null,null,null,null,null,null,0,null,"","","",""]
[null,null,null,null,null,null,null,null,0,null,"","","",""]
[null,null,null,null,null,null,null,null,0,null,"","","",""]
[null,null,null,null,null,null,null,null,0,null,"","","",""]
[null,null,null,null,null,null,null,null,0,null,"","","",""]
[null,null,null,null,null,null,null,null,0,null,"","","",""]
[null,null,null,null,null,null,null,null,0,null,"","","",""]
[null,null,null,null,null,null,null,null,0,null,"","","",""]
[null,null,null,null,null,null,null,null,0,null,"","","",""]
[null,null,null,null,null,null,null,null,0,null,"","","",""]
[null,null,null,null,null,null,null,null,0,null,"","","",""]
[null,null,null,null,null,null,null,null,0,null,"","","",""]
[null,null,null,null,null,null,null,null,0,null,"","","",""]
[null,null,null,null,null,null,null,null,0,null,"","","",""]
[null,null,null,null,null,null,null,null,{"$f":"IFERROR(G2663+H2663,\"\")","v":0},null,{"$f":"IFERROR(IF(J2663<>\"\",F2663*J2663,\"\"),\"\")","v":""},{"$f":"IFERROR(IF(J2663<>\"\",G2663*J2663,\"\"),\"\")","v":""},{"$f":"IFERROR(IF(J2663<>\"\",H2663*J2663,\"\"),\"\")","v":""},{"$f":"IFERROR(L2663+M2663,\"\")","v":""}]
[null,null,null,null,null,null,null,null,0,null,"","","",""]
[null,null,null,null,null,null,null,null,0,null,"","","",""]
[null,null,null,null,null,null,null,null,0,null,"","","",""]
[null,null,null,null,null,null,null,null,0,null,"","","",""]
[null,null,null,null,null,null,null,null,0,null,"","","",""]
[null,null,null,null,null,null,null,null,0,null,"","","",""]
[null,null,null,null,null,null,null,null,0,null,"","","",""]
[null,null,null,null,null,null,null,null,0,null,"","","",""]
[null,null,null,null,null,null,null,null,0,null,"","","",""]
[null,null,null,null,null,null,null,null,0,null,"","","",""]
[null,null,null,null,null,null,null,null,0,null,"","","",""]
[null,null,null,null,null,null,null,null,0,null,"","","",""]
[null,null,null,null,null,null,null,null,0,null,"","","",""]
[null,null,null,null,null,null,null,null,0,null,"","","",""]
[null,null,null,null,null,null,null,null,0,null,"","","",""]
[null,null,null,null,null,null,null,null,0,null,"","","",""]
[null,null,null,null,null,null,null,null,0,null,"","","",""]
[null,null,null,null,null,null,null,null,0,null,"","","",""]
[null,null,null,null,null,null,null,null,0,null,"","","",""]
[null,null,null,null,null,null,null,null,0,null,"","","",""]
[null,null,null,null,null,null,null,null,0,null,"","","",""]
[null,null,null,null,null,null,null,null,0,null,"","","",""]
[null,null,null,null,null,null,null,null,0,null,"","","",""]
[null,null,null,null,null,null,null,null,0,null,"","","",""]
[null,null,null,null,null,null,null,null,0,null,"","","",""]
[null,null,null,null,null,null,null,null,0,null,"","","",""]
[null,null,null,null,null,null,null,null,0,null,"","","",""]
[null,null,null,null,null,null,null,null,0,null,"","","",""]
[null,null,null,null,null,null,null,null,0,null,"","","",""]
[null,null,null,null,null,null,null,null,0,null,"","","",""]
[null,null,null,null,null,null,null,null,0,null,"","","",""]
[null,null,null,null,null,null,null,null,0,null,"","","",""]
[null,null,null,null,null,null,null,null,0,null,"","","",""]
[null,null,null,null,null,null,null,null,0,null,"","","",""]
[null,null,null,null,null,null,null,null,0,null,"","","",""]
[null,null,null,null,null,null,null,null,0,null,"","","",""]
[null,null,null,null,null,null,null,null,0,null,"","","",""]
[null,null,null,null,null,null,null,null,0,null,"","","",""]
[null,null,null,null,null,null,null,null,0,null,"","","",""]
[null,null,null,null,null,null,null,null,0,null,"","","",""]
[null,null,null,null,null,null,null,null,0,null,"","","",""]
[null,null,null,null,null,null,null,null,0,null,"","","",""]
[null,null,null,null,null,null,null,null,0,null,"","","",""]
[null,null,null,null,null,null,null,null,0,null,"","","",""]
[null,null,null,null,null,null,null,null,0,null,"","","",""]
[null,null,null,null,null,null,null,null,0,null,"","","",""]
[null,null,null,null,null,null,null,null,0,null,"","","",""]
[null,null,null,null,null,null,null,null,0,null,"","","",""]
[null,null,null,null,null,null,null,null,0,null,"","","",""]
[null,null,null,null,null,null,null,null,0,null,"","","",""]
[null,null,null,null,null,null,null,null,0,null,"","","",""]
[null,null,null,null,null,null,null,null,0,null,"","","",""]
[null,null,null,null,null,null,null,null,0,null,"","","",""]
[null,null,null,null,null,null,null,null,0,null,"","","",""]
[null,null,null,null,null,null,null,null,0,null,"","","",""]
[null,null,null,null,null,null,null,null,0,null,"","","",""]
[null,null,null,null,null,null,null,null,0,null,"","","",""]
[null,null,null,null,null,null,null,null,0,null,"","","",""]
[null,null,null,null,null,null,null,null,0,null,"","","",""]
[null,null,null,null,null,null,null,null,0,null,"","","",""]
[null,null,null,null,null,null,null,null,0,null,"","","",""]
[null,null,null,null,null,null,null,null,0,null,"","","",""]
[null,null,null,null,null,null,null,null,0,null,"","","",""]
[null,null,null,null,null,null,null,null,{"$f":"IFERROR(G2727+H2727,\"\")","v":0},null,{"$f":"IFERROR(IF(J2727<>\"\",F2727*J2727,\"\"),\"\")","v":""},{"$f":"IFERROR(IF(J2727<>\"\",G2727*J2727,\"\"),\"\")","v":""},{"$f":"IFERROR(IF(J2727<>\"\",H2727*J2727,\"\"),\"\")","v":""},{"$f":"IFERROR(L2727+M2727,\"\")","v":""}]
[null,null,null,null,null,null,null,null,0,null,"","","",""]
[null,null,null,null,null,null,null,null,0,null,"","","",""]
[null,null,null,null,null,null,null,null,0,null,"","","",""]
[null,null,null,null,null,null,null,null,0,null,"","","",""]
[null,null,null,null,null,null,null,null,0,null,"","","",""]
[null,null,null,null,null,null,null,null,0,null,"","","",""]
[null,null,null,null,null,null,null,null,0,null,"","","",""]
[null,null,null,null,null,null,null,null,0,null,"","","",""]
[null,null,null,null,null,null,null,null,0,null,"","","",""]
[null,null,null,null,null,null,null,null,0,null,"","","",""]
[null,null,null,null,null,null,null,null,0,null,"","","",""]
[null,null,null,null,null,null,null,null,0,null,"","","",""]
[null,null,null,null,null,null,null,null,0,null,"","","",""]
[null,null,null,null,null,null,null,null,0,null,"","","",""]
[null,null,null,null,null,null,null,null,0,null,"","","",""]
[null,null,null,null,null,null,null,null,0,null,"","","",""]
[null,null,null,null,null,null,null,null,0,null,"","","",""]
[null,null,null,null,null,null,null,null,0,null,"","","",""]
[null,null,null,null,null,null,null,null,0,null,"","","",""]
[null,null,null,null,null,null,null,null,0,null,"","","",""]
[null,null,null,null,null,null,null,null,0,null,"","","",""]
[null,null,null,null,null,null,null,null,0,null,"","","",""]
[null,null,null,null,null,null,null,null,0,null,"","","",""]
[null,null,null,null,null,null,null,null,0,null,"","","",""]
[null,null,null,null,null,null,null,null,0,null,"","","",""]
[null,null,null,null,null,null,null,null,0,null,"","","",""]
[null,null,null,null,null,null,null,null,0,null,"","","",""]
[null,null,null,null,null,null,null,null,0,null,"","","",""]
[null,null,null,null,null,null,null,null,0,null,"","","",""]
[null,null,null,null,null,null,null,null,0,null,"","","",""]
[null,null,null,null,null,null,null,null,0,null,"","","",""]
[null,null,null,null,null,null,null,null,0,null,"","","",""]
[null,null,null,null,null,null,null,null,0,null,"","","",""]
[null,null,null,null,null,null,null,null,0,null,"","","",""]
[null,null,null,null,null,null,null,null,0,null,"","","",""]
[null,null,null,null,null,null,null,null,0,null,"","","",""]
[null,null,null,null,null,null,null,null,0,null,"","","",""]
[null,null,null,null,null,null,null,null,0,null,"","","",""]
[null,null,null,null,null,null,null,null,0,null,"","","",""]
[null,null,null,null,null,null,null,null,0,null,"","","",""]
[null,null,null,null,null,null,null,null,0,null,"","","",""]
[null,null,null,null,null,null,null,null,0,null,"","","",""]
[null,null,null,null,null,null,null,null,0,null,"","","",""]
[null,null,null,null,null,null,null,null,0,null,"","","",""]
[null,null,null,null,null,null,null,null,0,null,"","","",""]
[null,null,null,null,null,null,null,null,0,null,"","","",""]
[null,null,null,null,null,null,null,null,0,null,"","","",""]
[null,null,null,null,null,null,null,null,0,null,"","","",""]
[null,null,null,null,null,null,null,null,0,null,"","","",""]
[null,null,null,null,null,null,null,null,0,null,"","","",""]
[null,null,null,null,null,null,null,null,0,null,"","","",""]
[null,null,null,null,null,null,null,null,0,null,"","","",""]
[null,null,null,null,null,null,null,null,0,null,"","","",""]
[null,null,null,null,null,null,null,null,0,null,"","","",""]
[null,null,null,null,null,null,null,null,0,null,"","","",""]
[null,null,null,null,null,null,null,null,0,null,"","","",""]
[null,null,null,null,null,null,null,null,0,null,"","","",""]
[null,null,null,null,null,null,null,null,0,null,"","","",""]
[null,null,null,null,null,null,null,null,0,null,"","","",""]
[null,null,null,null,null,null,null,null,0,null,"","","",""]
[null,null,null,null,null,null,null,null,0,null,"","","",""]
[null,null,null,null,null,null,null,null,0,null,"","","",""]
[null,null,null,null,null,null,null,null,0,null,"","","",""]
[null,null,null,null,null,null,null,null,{"$f":"IFERROR(G2791+H2791,\"\")","v":0},null,{"$f":"IFERROR(IF(J2791<>\"\",F2791*J2791,\"\"),\"\")","v":""},{"$f":"IFERROR(IF(J2791<>\"\",G2791*J2791,\"\"),\"\")","v":""},{"$f":"IFERROR(IF(J2791<>\"\",H2791*J2791,\"\"),\"\")","v":""},{"$f":"IFERROR(L2791+M2791,\"\")","v":""}]
[null,null,null,null,null,null,null,null,0,null,"","","",""]
[null,null,null,null,null,null,null,null,0,null,"","","",""]
[null,null,null,null,null,null,null,null,0,null,"","","",""]
[null,null,null,null,null,null,null,null,0,null,"","","",""]
[null,null,null,null,null,null,null,null,0,null,"","","",""]
[null,null,null,null,null,null,null,null,0,null,"","","",""]
[null,null,null,null,null,null,null,null,0,null,"","","",""]
[null,null,null,null,null,null,null,null,0,null,"","","",""]
[null,null,null,null,null,null,null,null,0,null,"","","",""]
[null,null,null,null,null,null,null,null,0,null,"","","",""]
[null,null,null,null,null,null,null,null,0,null,"","","",""]
[null,null,null,null,null,null,null,null,0,null,"","","",""]
[null,null,null,null,null,null,null,null,0,null,"","","",""]
[null,null,null,null,null,null,null,null,0,null,"","","",""]
[null,null,null,null,null,null,null,null,0,null,"","","",""]
[null,null,null,null,null,null,null,null,0,null,"","","",""]
[null,null,null,null,null,null,null,null,0,null,"","","",""]
[null,null,null,null,null,null,null,null,0,null,"","","",""]
[null,null,null,null,null,null,null,null,0,null,"","","",""]
[null,null,null,null,null,null,null,null,0,null,"","","",""]
[null,null,null,null,null,null,null,null,0,null,"","","",""]
[null,null,null,null,null,null,null,null,0,null,"","","",""]
[null,null,null,null,null,null,null,null,0,null,"","","",""]
[null,null,null,null,null,null,null,null,0,null,"","","",""]
[null,null,null,null,null,null,null,null,0,null,"","","",""]
[null,null,null,null,null,null,null,null,0,null,"","","",""]
[null,null,null,null,null,null,null,null,0,null,"","","",""]
[null,null,null,null,null,null,null,null,0,null,"","","",""]
[null,null,null,null,null,null,null,null,0,null,"","","",""]
[null,null,null,null,null,null,null,null,0,null,"","","",""]
[null,null,null,null,null,null,null,null,0,null,"","","",""]
[null,null,null,null,null,null,null,null,0,null,"","","",""]
[null,null,null,null,null,null,null,null,0,null,"","","",""]
[null,null,null,null,null,null,null,null,0,null,"","","",""]
[null,null,null,null,null,null,null,null,0,null,"","","",""]
[null,null,null,null,null,null,null,null,0,null,"","","",""]
[null,null,null,null,null,null,null,null,0,null,"","","",""]
[null,null,null,null,null,null,null,null,0,null,"","","",""]
[null,null,null,null,null,null,null,null,0,null,"","","",""]
[null,null,null,null,null,null,null,null,0,null,"","","",""]
[null,null,null,null,null,null,null,null,0,null,"","","",""]
[null,null,null,null,null,null,null,null,0,null,"","","",""]
[null,null,null,null,null,null,null,null,0,null,"","","",""]
[null,null,null,null,null,null,null,null,0,null,"","","",""]
[null,null,null,null,null,null,null,null,0,null,"","","",""]
[null,null,null,null,null,null,null,null,0,null,"","","",""]
[null,null,null,null,null,null,null,null,0,null,"","","",""]
[null,null,null,null,null,null,null,null,0,null,"","","",""]
[null,null,null,null,null,null,null,null,0,null,"","","",""]
[null,null,null,null,null,null,null,null,0,null,"","","",""]
[null,null,null,null,null,null,null,null,0,null,"","","",""]
[null,null,null,null,null,null,null,null,0,null,"","","",""]
[null,null,null,null,null,null,null,null,0,null,"","","",""]
[null,null,null,null,null,null,null,null,0,null,"","","",""]
[null,null,null,null,null,null,null,null,0,null,"","","",""]
[null,null,null,null,null,null,null,null,0,null,"","","",""]
[null,null,null,null,null,null,null,null,0,null,"","","",""]
[null,null,null,null,null,null,null,null,0,null,"","","",""]
[null,null,null,null,null,null,null,null,0,null,"","","",""]
[null,null,null,null,null,null,null,null,0,null,"","","",""]
[null,null,null,null,null,null,null,null,0,null,"","","",""]
[null,null,null,null,null,null,null,null,0,null,"","","",""]
[null,null,null,null,null,null,null,null,0,null,"","","",""]
[null,null,null,null,null,null,null,null,{"$f":"IFERROR(G2855+H2855,\"\")","v":0},null,{"$f":"IFERROR(IF(J2855<>\"\",F2855*J2855,\"\"),\"\")","v":""},{"$f":"IFERROR(IF(J2855<>\"\",G2855*J2855,\"\"),\"\")","v":""},{"$f":"IFERROR(IF(J2855<>\"\",H2855*J2855,\"\"),\"\")","v":""},{"$f":"IFERROR(L2855+M2855,\"\")","v":""}]
[null,null,null,null,null,null,null,null,0,null,"","","",""]
[null,null,null,null,null,null,null,null,0,null,"","","",""]
[null,null,null,null,null,null,null,null,0,null,"","","",""]
[null,null,null,null,null,null,null,null,0,null,"","","",""]
[null,null,null,null,null,null,null,null,0,null,"","","",""]
[null,null,null,null,null,null,null,null,0,null,"","","",""]
[null,null,null,null,null,null,null,null,0,null,"","","",""]
[null,null,null,null,null,null,null,null,0,null,"","","",""]
[null,null,null,null,null,null,null,null,0,null,"","","",""]
[null,null,null,null,null,null,null,null,0,null,"","","",""]
[null,null,null,null,null,null,null,null,0,null,"","","",""]
[null,null,null,null,null,null,null,null,0,null,"","","",""]
[null,null,null,null,null,null,null,null,0,null,"","","",""]
[null,null,null,null,null,null,null,null,0,null,"","","",""]
[null,null,null,null,null,null,null,null,0,null,"","","",""]
[null,null,null,null,null,null,null,null,0,null,"","","",""]
[null,null,null,null,null,null,null,null,0,null,"","","",""]
[null,null,null,null,null,null,null,null,0,null,"","","",""]
[null,null,null,null,null,null,null,null,0,null,"","","",""]
[null,null,null,null,null,null,null,null,0,null,"","","",""]
[null,null,null,null,null,null,null,null,0,null,"","","",""]
[null,null,null,null,null,null,null,null,0,null,"","","",""]
[null,null,null,null,null,null,null,null,0,null,"","","",""]
[null,null,null,null,null,null,null,null,0,null,"","","",""]
[null,null,null,null,null,null,null,null,0,null,"","","",""]
[null,null,null,null,null,null,null,null,0,null,"","","",""]
[null,null,null,null,null,null,null,null,0,null,"","","",""]
[null,null,null,null,null,null,null,null,0,null,"","","",""]
[null,null,null,null,null,null,null,null,0,null,"","","",""]
[null,null,null,null,null,null,null,null,0,null,"","","",""]
[null,null,null,null,null,null,null,null,0,null,"","","",""]
[null,null,null,null,null,null,null,null,0,null,"","","",""]
[null,null,null,null,null,null,null,null,0,null,"","","",""]
[null,null,null,null,null,null,null,null,0,null,"","","",""]
[null,null,null,null,null,null,null,null,0,null,"","","",""]
[null,null,null,null,null,null,null,null,0,null,"","","",""]
[null,null,null,null,null,null,null,null,0,null,"","","",""]
[null,null,null,null,null,null,null,null,0,null,"","","",""]
[null,null,null,null,null,null,null,null,0,null,"","","",""]
[null,null,null,null,null,null,null,null,0,null,"","","",""]
[null,null,null,null,null,null,null,null,0,null,"","","",""]
[null,null,null,null,null,null,null,null,0,null,"","","",""]
[null,null,null,null,null,null,null,null,0,null,"","","",""]
[null,null,null,null,null,null,null,null,0,null,"","","",""]
[null,null,null,null,null,null,null,null,0,null,"","","",""]
[null,null,null,null,null,null,null,null,0,null,"","","",""]
[null,null,null,null,null,null,null,null,0,null,"","","",""]
[null,null,null,null,null,null,null,null,0,null,"","","",""]
[null,null,null,null,null,null,null,null,0,null,"","","",""]
[null,null,null,null,null,null,null,null,0,null,"","","",""]
[null,null,null,null,null,null,null,null,0,null,"","","",""]
[null,null,null,null,null,null,null,null,0,null,"","","",""]
[null,null,null,null,null,null,null,null,0,null,"","","",""]
[null,null,null,null,null,null,null,null,0,null,"","","",""]
[null,null,null,null,null,null,null,null,0,null,"","","",""]
[null,null,null,null,null,null,null,null,0,null,"","","",""]
[null,null,null,null,null,null,null,null,0,null,"","","",""]
[null,null,null,null,null,null,null,null,0,null,"","","",""]
[null,null,null,null,null,null,null,null,0,null,"","","",""]
[null,null,null,null,null,null,null,null,0,null,"","","",""]
[null,null,null,null,null,null,null,null,0,null,"","","",""]
[null,null,null,null,null,null,null,null,0,null,"","","",""]
[null,null,null,null,null,null,null,null,0,null,"","","",""]
[null,null,null,null,null,null,null,null,{"$f":"IFERROR(G2919+H2919,\"\")","v":0},null,{"$f":"IFERROR(IF(J2919<>\"\",F2919*J2919,\"\"),\"\")","v":""},{"$f":"IFERROR(IF(J2919<>\"\",G2919*J2919,\"\"),\"\")","v":""},{"$f":"IFERROR(IF(J2919<>\"\",H2919*J2919,\"\"),\"\")","v":""},{"$f":"IFERROR(L2919+M2919,\"\")","v":""}]
[null,null,null,null,null,null,null,null,0,null,"","","",""]
[null,null,null,null,null,null,null,null,0,null,"","","",""]
[null,null,null,null,null,null,null,null,0,null,"","","",""]
[null,null,null,null,null,null,null,null,0,null,"","","",""]
[null,null,null,null,null,null,null,null,0,null,"","","",""]
[null,null,null,null,null,null,null,null,0,null,"","","",""]
[null,null,null,null,null,null,null,null,0,null,"","","",""]
[null,null,null,null,null,null,null,null,0,null,"","","",""]
[null,null,null,null,null,null,null,null,0,null,"","","",""]
[null,null,null,null,null,null,null,null,0,null,"","","",""]
[null,null,null,null,null,null,null,null,0,null,"","","",""]
[null,null,null,null,null,null,null,null,0,null,"","","",""]
[null,null,null,null,null,null,null,null,0,null,"","","",""]
[null,null,null,null,null,null,null,null,0,null,"","","",""]
[null,null,null,null,null,null,null,null,0,null,"","","",""]
[null,null,null,null,null,null,null,null,0,null,"","","",""]
[null,null,null,null,null,null,null,null,0,null,"","","",""]
[null,null,null,null,null,null,null,null,0,null,"","","",""]
[null,null,null,null,null,null,null,null,0,null,"","","",""]
[null,null,null,null,null,null,null,null,0,null,"","","",""]
[null,null,null,null,null,null,null,null,0,null,"","","",""]
[null,null,null,null,null,null,null,null,0,null,"","","",""]
[null,null,null,null,null,null,null,null,0,null,"","","",""]
[null,null,null,null,null,null,null,null,0,null,"","","",""]
[null,null,null,null,null,null,null,null,0,null,"","","",""]
[null,null,null,null,null,null,null,null,0,null,"","","",""]
[null,null,null,null,null,null,null,null,0,null,"","","",""]
[null,null,null,null,null,null,null,null,0,null,"","","",""]
[null,null,null,null,null,null,null,null,0,null,"","","",""]
[null,null,null,null,null,null,null,null,0,null,"","","",""]
[null,null,null,null,null,null,null,null,0,null,"","","",""]
[null,null,null,null,null,null,null,null,0,null,"","","",""]
[null,null,null,null,null,null,null,null,0,null,"","","",""]
[null,null,null,null,null,null,null,null,0,null,"","","",""]
[null,null,null,null,null,null,null,null,0,null,"","","",""]
[null,null,null,null,null,null,null,null,0,null,"","","",""]
[null,null,null,null,null,null,null,null,0,null,"","","",""]
[null,null,null,null,null,null,null,null,0,null,"","","",""]
[null,null,null,null,null,null,null,null,0,null,"","","",""]
[null,null,null,null,null,null,null,null,0,null,"","","",""]
[null,null,null,null,null,null,null,null,0,null,"","","",""]
[null,null,null,null,null,null,null,null,0,null,"","","",""]
[null,null,null,null,null,null,null,null,0,null,"","","",""]
[null,null,null,null,null,null,null,null,0,null,"","","",""]
[null,null,null,null,null,null,null,null,0,null,"","","",""]
[null,null,null,null,null,null,null,null,0,null,"","","",""]
[null,null,null,null,null,null,null,null,0,null,"","","",""]
[null,null,null,null,null,null,null,null,0,null,"","","",""]
[null,null,null,null,null,null,null,null,0,null,"","","",""]
[null,null,null,null,null,null,null,null,0,null,"","","",""]
[null,null,null,null,null,null,null,null,0,null,"","","",""]
[null,null,null,null,null,null,null,null,0,null,"","","",""]
[null,null,null,null,null,null,null,null,0,null,"","","",""]
[null,null,null,null,null,null,null,null,0,null,"","","",""]
[null,null,null,null,null,null,null,null,0,null,"","","",""]
[null,null,null,null,null,null,null,null,0,null,"","","",""]
[null,null,null,null,null,null,null,null,0,null,"","","",""]
[null,null,null,null,null,null,null,null,0,null,"","","",""]
[null,null,null,null,null,null,null,null,0,null,"","","",""]
[null,null,null,null,null,null,null,null,0,null,"","","",""]
[null,null,null,null,null,null,null,null,0,null,"","","",""]
[null,null,null,null,null,null,null,null,0,null,"","","",""]
[null,null,null,null,null,null,null,null,0,null,"","","",""]
[null,null,null,null,null,null,null,null,{"$f":"IFERROR(G2983+H2983,\"\")","v":0},null,{"$f":"IFERROR(IF(J2983<>\"\",F2983*J2983,\"\"),\"\")","v":""},{"$f":"IFERROR(IF(J2983<>\"\",G2983*J2983,\"\"),\"\")","v":""},{"$f":"IFERROR(IF(J2983<>\"\",H2983*J2983,\"\"),\"\")","v":""},{"$f":"IFERROR(L2983+M2983,\"\")","v":""}]
[null,null,null,null,null,null,null,null,0,null,"","","",""]
[null,null,null,null,null,null,null,null,0,null,"","","",""]
[null,null,null,null,null,null,null,null,0,null,"","","",""]
[null,null,null,null,null,null,null,null,0,null,"","","",""]
[null,null,null,null,null,null,null,null,0,null,"","","",""]
[null,null,null,null,null,null,null,null,0,null,"","","",""]
[null,null,null,null,null,null,null,null,0,null,"","","",""]
[null,null,null,null,null,null,null,null,0,null,"","","",""]
[null,null,null,null,null,null,null,null,0,null,"","","",""]
[null,null,null,null,null,null,null,null,0,null,"","","",""]
[null,null,null,null,null,null,null,null,0,null,"","","",""]
[null,null,null,null,null,null,null,null,0,null,"","","",""]
[null,null,null,null,null,null,null,null,0,null,"","","",""]
[null,null,null,null,null,null,null,null,0,null,"","","",""]
[null,null,null,null,null,null,null,null,0,null,"","","",""]
[null,null,null,null,null,null,null,null,0,null,"","","",""]
[null,null,null,null,null,null,null,null,0,null,"","","",""]
[null,null,null,null,null,null,null,null,0,null,"","","",""]
[null,null,null,null,null,null,null,null,0,null,"","","",""]
[null,null,null,null,null,null,null,null,0,null,"","","",""]
[null,null,null,null,null,null,null,null,0,null,"","","",""]
[null,null,null,null,null,null,null,null,0,null,"","","",""]
[null,null,null,null,null,null,null,null,0,null,"","","",""]
[null,null,null,null,null,null,null,null,0,null,"","","",""]
[null,null,null,null,null,null,null,null,0,null,"","","",""]
[null,null,null,null,null,null,null,null,0,null,"","","",""]
[null,null,null,null,null,null,null,null,0,null,"","","",""]
[null,null,null,null,null,null,null,null,0,null,"","","",""]
[null,null,null,null,null,null,null,null,0,null,"","","",""]
[null,null,null,null,null,null,null,null,0,null,"","","",""]
[null,null,null,null,null,null,null,null,0,null,"","","",""]
[null,null,null,null,null,null,null,null,0,null,"","","",""]
[null,null,null,null,null,null,null,null,0,null,"","","",""]
[null,null,null,null,null,null,null,null,0,null,"","","",""]
[null,null,null,null,null,null,null,null,0,null,"","","",""]
[null,null,null,null,null,null,null,null,0,null,"","","",""]
[null,null,null,null,null,null,null,null,0,null,"","","",""]
[null,null,null,null,null,null,null,null,0,null,"","","",""]
[null,null,null,null,null,null,null,null,0,null,"","","",""]
[null,null,null,null,null,null,null,null,0,null,"","","",""]
[null,null,null,null,null,null,null,null,0,null,"","","",""]
[null,null,null,null,null,null,null,null,0,null,"","","",""]
[null,null,null,null,null,null,null,null,0,null,"","","",""]
[null,null,null,null,null,null,null,null,0,null,"","","",""]
[null,null,null,null,null,null,null,null,0,null,"","","",""]
[null,null,null,null,null,null,null,null,0,null,"","","",""]
[null,null,null,null,null,null,null,null,0,null,"","","",""]
[null,null,null,null,null,null,null,null,0,null,"","","",""]
[null,null,null,null,null,null,null,null,0,null,"","","",""]
[null,null,null,null,null,null,null,null,0,null,"","","",""]
[null,null,null,null,null,null,null,null,0,null,"","","",""]
[null,null,null,null,null,null,null,null,0,null,"","","",""]
[null,null,null,null,null,null,null,null,0,null,"","","",""]
[null,null,null,null,null,null,null,null,0,null,"","","",""]
[null,null,null,null,null,null,null,null,0,null,"","","",""]
[null,null,null,null,null,null,null,null,0,null,"","","",""]
[null,null,null,null,null,null,null,null,0,null,"","","",""]
[null,null,null,null,null,null,null,null,0,null,"","","",""]
[null,null,null,null,null,null,null,null,0,null,"","","",""]
[null,null,null,null,null,null,null,null,0,null,"","","",""]
[null,null,null,null,null,null,null,null,0,null,"","","",""]
[null,null,null,null,null,null,null,null,0,null,"","","",""]
[null,null,null,null,null,null,null,null,0,null,"","","",""]
[null,null,null,null,null,null,null,null,{"$f":"IFERROR(G3047+H3047,\"\")","v":0},null,{"$f":"IFERROR(IF(J3047<>\"\",F3047*J3047,\"\"),\"\")","v":""},{"$f":"IFERROR(IF(J3047<>\"\",G3047*J3047,\"\"),\"\")","v":""},{"$f":"IFERROR(IF(J3047<>\"\",H3047*J3047,\"\"),\"\")","v":""},{"$f":"IFERROR(L3047+M3047,\"\")","v":""}]
[null,null,null,null,null,null,null,null,0,null,"","","",""]
[null,null,null,null,null,null,null,null,0,null,"","","",""]
[null,null,null,null,null,null,null,null,0,null,"","","",""]
[null,null,null,null,null,null,null,null,0,null,"","","",""]
[null,null,null,null,null,null,null,null,0,null,"","","",""]
[null,null,null,null,null,null,null,null,0,null,"","","",""]
[null,null,null,null,null,null,null,null,0,null,"","","",""]
[null,null,null,null,null,null,null,null,0,null,"","","",""]
[null,null,null,null,null,null,null,null,0,null,"","","",""]
[null,null,null,null,null,null,null,null,0,null,"","","",""]
[null,null,null,null,null,null,null,null,0,null,"","","",""]
[null,null,null,null,null,null,null,null,0,null,"","","",""]
[null,null,null,null,null,null,null,null,0,null,"","","",""]
[null,null,null,null,null,null,null,null,0,null,"","","",""]
[null,null,null,null,null,null,null,null,0,null,"","","",""]
[null,null,null,null,null,null,null,null,0,null,"","","",""]
[null,null,null,null,null,null,null,null,0,null,"","","",""]
[null,null,null,null,null,null,null,null,0,null,"","","",""]
[null,null,null,null,null,null,null,null,0,null,"","","",""]
[null,null,null,null,null,null,null,null,0,null,"","","",""]
[null,null,null,null,null,null,null,null,0,null,"","","",""]
[null,null,null,null,null,null,null,null,0,null,"","","",""]
[null,null,null,null,null,null,null,null,0,null,"","","",""]
[null,null,null,null,null,null,null,null,0,null,"","","",""]
[null,null,null,null,null,null,null,null,0,null,"","","",""]
[null,null,null,null,null,null,null,null,0,null,"","","",""]
[null,null,null,null,null,null,null,null,0,null,"","","",""]
[null,null,null,null,null,null,null,null,0,null,"","","",""]
[null,null,null,null,null,null,null,null,0,null,"","","",""]
[null,null,null,null,null,null,null,null,0,null,"","","",""]
[null,null,null,null,null,null,null,null,0,null,"","","",""]
[null,null,null,null,null,null,null,null,0,null,"","","",""]
[null,null,null,null,null,null,null,null,0,null,"","","",""]
[null,null,null,null,null,null,null,null,0,null,"","","",""]
[null,null,null,null,null,null,null,null,0,null,"","","",""]
[null,null,null,null,null,null,null,null,0,null,"","","",""]
[null,null,null,null,null,null,null,null,0,null,"","","",""]
[null,null,null,null,null,null,null,null,0,null,"","","",""]
[null,null,null,null,null,null,null,null,0,null,"","","",""]
[null,null,null,null,null,null,null,null,0,null,"","","",""]
[null,null,null,null,null,null,null,null,0,null,"","","",""]
[null,null,null,null,null,null,null,null,0,null,"","","",""]
[null,null,null,null,null,null,null,null,0,null,"","","",""]
[null,null,null,null,null,null,null,null,0,null,"","","",""]
[null,null,null,null,null,null,null,null,0,null,"","","",""]
[null,null,null,null,null,null,null,null,0,null,"","","",""]
[null,null,null,null,null,null,null,null,0,null,"","","",""]
[null,null,null,null,null,null,null,null,0,null,"","","",""]
[null,null,null,null,null,null,null,null,0,null,"","","",""]
[null,null,null,null,null,null,null,null,0,null,"","","",""]
[null,null,null,null,null,null,null,null,0,null,"","","",""]
[null,null,null,null,null,null,null,null,0,null,"","","",""]
[null,null,null,null,null,null,null,null,0,null,"","","",""]
[null,null,null,null,null,null,null,null,0,null,"","","",""]
[null,null,null,null,null,null,null,null,0,null,"","","",""]
[null,null,null,null,null,null,null,null,0,null,"","","",""]
[null,null,null,null,null,null,null,null,0,null,"","","",""]
[null,null,null,null,null,null,null,null,0,null,"","","",""]
[null,null,null,null,null,null,null,null,0,null,"","","",""]
[null,null,null,null,null,null,null,null,0,null,"","","",""]
[null,null,null,null,null,null,null,null,0,null,"","","",""]
[null,null,null,null,null,null,null,null,0,null,"","","",""]
[null,null,null,null,null,null,null,null,0,null,"","","",""]
[null,null,null,null,null,null,null,null,{"$f":"IFERROR(G3111+H3111,\"\")","v":0},null,{"$f":"IFERROR(IF(J3111<>\"\",F3111*J3111,\"\"),\"\")","v":""},{"$f":"IFERROR(IF(J3111<>\"\",G3111*J3111,\"\"),\"\")","v":""},{"$f":"IFERROR(IF(J3111<>\"\",H3111*J3111,\"\"),\"\")","v":""},{"$f":"IFERROR(L3111+M3111,\"\")","v":""}]
[null,null,null,null,null,null,null,null,0,null,"","","",""]
[null,null,null,null,null,null,null,null,0,null,"","","",""]
[null,null,null,null,null,null,null,null,0,null,"","","",""]
[null,null,null,null,null,null,null,null,0,null,"","","",""]
[null,null,null,null,null,null,null,null,0,null,"","","",""]
[null,null,null,null,null,null,null,null,0,null,"","","",""]
[null,null,null,null,null,null,null,null,0,null,"","","",""]
[null,null,null,null,null,null,null,null,0,null,"","","",""]
[null,null,null,null,null,null,null,null,0,null,"","","",""]
[null,null,null,null,null,null,null,null,0,null,"","","",""]
[null,null,null,null,null,null,null,null,0,null,"","","",""]
[null,null,null,null,null,null,null,null,0,null,"","","",""]
[null,null,null,null,null,null,null,null,0,null,"","","",""]
[null,null,null,null,null,null,null,null,0,null,"","","",""]
[null,null,null,null,null,null,null,null,0,null,"","","",""]
[null,null,null,null,null,null,null,null,0,null,"","","",""]
[null,null,null,null,null,null,null,null,0,null,"","","",""]
[null,null,null,null,null,null,null,null,0,null,"","","",""]
[null,null,null,null,null,null,null,null,0,null,"","","",""]
[null,null,null,null,null,null,null,null,0,null,"","","",""]
[null,null,null,null,null,null,null,null,0,null,"","","",""]
[null,null,null,null,null,null,null,null,0,null,"","","",""]
[null,null,null,null,null,null,null,null,0,null,"","","",""]
[null,null,null,null,null,null,null,null,0,null,"","","",""]
[null,null,null,null,null,null,null,null,0,null,"","","",""]
[null,null,null,null,null,null,null,null,0,null,"","","",""]
[null,null,null,null,null,null,null,null,0,null,"","","",""]
[null,null,null,null,null,null,null,null,0,null,"","","",""]
[null,null,null,null,null,null,null,null,0,null,"","","",""]
[null,null,null,null,null,null,null,null,0,null,"","","",""]
[null,null,null,null,null,null,null,null,0,null,"","","",""]
[null,null,null,null,null,null,null,null,0,null,"","","",""]
[null,null,null,null,null,null,null,null,0,null,"","","",""]
[null,null,null,null,null,null,null,null,0,null,"","","",""]
[null,null,null,null,null,null,null,null,0,null,"","","",""]
[null,null,null,null,null,null,null,null,0,null,"","","",""]
[null,null,null,null,null,null,null,null,0,null,"","","",""]
[null,null,null,null,null,null,null,null,0,null,"","","",""]
[null,null,null,null,null,null,null,null,0,null,"","","",""]
[null,null,null,null,null,null,null,null,0,null,"","","",""]
[null,null,null,null,null,null,null,null,0,null,"","","",""]
[null,null,null,null,null,null,null,null,0,null,"","","",""]
[null,null,null,null,null,null,null,null,0,null,"","","",""]
[null,null,null,null,null,null,null,null,0,null,"","","",""]
[null,null,null,null,null,null,null,null,0,null,"","","",""]
[null,null,null,null,null,null,null,null,0,null,"","","",""]
[null,null,null,null,null,null,null,null,0,null,"","","",""]
[null,null,null,null,null,null,null,null,0,null,"","","",""]
[null,null,null,null,null,null,null,null,0,null,"","","",""]
[null,null,null,null,null,null,null,null,0,null,"","","",""]
[null,null,null,null,null,null,null,null,0,null,"","","",""]
[null,null,null,null,null,null,null,null,0,null,"","","",""]
[null,null,null,null,null,null,null,null,0,null,"","","",""]
[null,null,null,null,null,null,null,null,0,null,"","","",""]
[null,null,null,null,null,null,null,null,0,null,"","","",""]
[null,null,null,null,null,null,null,null,0,null,"","","",""]
[null,null,null,null,null,null,null,null,0,null,"","","",""]
[null,null,null,null,null,null,null,null,0,null,"","","",""]
[null,null,null,null,null,null,null,null,0,null,"","","",""]
[null,null,null,null,null,null,null,null,0,null,"","","",""]
[null,null,null,null,null,null,null,null,0,null,"","","",""]
[null,null,null,null,null,null,null,null,0,null,"","","",""]
[null,null,null,null,null,null,null,null,0,null,"","","",""]
[null,null,null,null,null,null,null,null,{"$f":"IFERROR(G3175+H3175,\"\")","v":0},null,{"$f":"IFERROR(IF(J3175<>\"\",F3175*J3175,\"\"),\"\")","v":""},{"$f":"IFERROR(IF(J3175<>\"\",G3175*J3175,\"\"),\"\")","v":""},{"$f":"IFERROR(IF(J3175<>\"\",H3175*J3175,\"\"),\"\")","v":""},{"$f":"IFERROR(L3175+M3175,\"\")","v":""}]
[null,null,null,null,null,null,null,null,0,null,"","","",""]
[null,null,null,null,null,null,null,null,0,null,"","","",""]
[null,null,null,null,null,null,null,null,0,null,"","","",""]
[null,null,null,null,null,null,null,null,0,null,"","","",""]
[null,null,null,null,null,null,null,null,0,null,"","","",""]
[null,null,null,null,null,null,null,null,0,null,"","","",""]
[null,null,null,null,null,null,null,null,0,null,"","","",""]
[null,null,null,null,null,null,null,null,0,null,"","","",""]
[null,null,null,null,null,null,null,null,0,null,"","","",""]
[null,null,null,null,null,null,null,null,0,null,"","","",""]
[null,null,null,null,null,null,null,null,0,null,"","","",""]
[null,null,null,null,null,null,null,null,0,null,"","","",""]
[null,null,null,null,null,null,null,null,0,null,"","","",""]
[null,null,null,null,null,null,null,null,0,null,"","","",""]
[null,null,null,null,null,null,null,null,0,null,"","","",""]
[null,null,null,null,null,null,null,null,0,null,"","","",""]
[null,null,null,null,null,null,null,null,0,null,"","","",""]
[null,null,null,null,null,null,null,null,0,null,"","","",""]
[null,null,null,null,null,null,null,null,0,null,"","","",""]
[null,null,null,null,null,null,null,null,0,null,"","","",""]
[null,null,null,null,null,null,null,null,0,null,"","","",""]
[null,null,null,null,null,null,null,null,0,null,"","","",""]
[null,null,null,null,null,null,null,null,0,null,"","","",""]
[null,null,null,null,null,null,null,null,0,null,"","","",""]
[null,null,null,null,null,null,null,null,0,null,"","","",""]
[null,null,null,null,null,null,null,null,0,null,"","","",""]
[null,null,null,null,null,null,null,null,0,null,"","","",""]
[null,null,null,null,null,null,null,null,0,null,"","","",""]
[null,null,null,null,null,null,null,null,0,null,"","","",""]
[null,null,null,null,null,null,null,null,0,null,"","","",""]
[null,null,null,null,null,null,null,null,0,null,"","","",""]
[null,null,null,null,null,null,null,null,0,null,"","","",""]
[null,null,null,null,null,null,null,null,0,null,"","","",""]
[null,null,null,null,null,null,null,null,0,null,"","","",""]
[null,null,null,null,null,null,null,null,0,null,"","","",""]
[null,null,null,null,null,null,null,null,0,null,"","","",""]
[null,null,null,null,null,null,null,null,0,null,"","","",""]
[null,null,null,null,null,null,null,null,0,null,"","","",""]
[null,null,null,null,null,null,null,null,0,null,"","","",""]
[null,null,null,null,null,null,null,null,0,null,"","","",""]
[null,null,null,null,null,null,null,null,0,null,"","","",""]
[null,null,null,null,null,null,null,null,0,null,"","","",""]
[null,null,null,null,null,null,null,null,0,null,"","","",""]
[null,null,null,null,null,null,null,null,0,null,"","","",""]
[null,null,null,null,null,null,null,null,0,null,"","","",""]
[null,null,null,null,null,null,null,null,0,null,"","","",""]
[null,null,null,null,null,null,null,null,0,null,"","","",""]
[null,null,null,null,null,null,null,null,0,null,"","","",""]
[null,null,null,null,null,null,null,null,0,null,"","","",""]
[null,null,null,null,null,null,null,null,0,null,"","","",""]
[null,null,null,null,null,null,null,null,0,null,"","","",""]
[null,null,null,null,null,null,null,null,0,null,"","","",""]
[null,null,null,null,null,null,null,null,0,null,"","","",""]
[null,null,null,null,null,null,null,null,0,null,"","","",""]
[null,null,null,null,null,null,null,null,0,null,"","","",""]
[null,null,null,null,null,null,null,null,0,null,"","","",""]
[null,null,null,null,null,null,null,null,0,null,"","","",""]
[null,null,null,null,null,null,null,null,0,null,"","","",""]
[null,null,null,null,null,null,null,null,0,null,"","","",""]
[null,null,null,null,null,null,null,null,0,null,"","","",""]
[null,null,null,null,null,null,null,null,0,null,"","","",""]
[null,null,null,null,null,null,null,null,0,null,"","","",""]
[null,null,null,null,null,null,null,null,0,null,"","","",""]
[null,null,null,null,null,null,null,null,{"$f":"IFERROR(G3239+H3239,\"\")","v":0},null,{"$f":"IFERROR(IF(J3239<>\"\",F3239*J3239,\"\"),\"\")","v":""},{"$f":"IFERROR(IF(J3239<>\"\",G3239*J3239,\"\"),\"\")","v":""},{"$f":"IFERROR(IF(J3239<>\"\",H3239*J3239,\"\"),\"\")","v":""},{"$f":"IFERROR(L3239+M3239,\"\")","v":""}]
[null,null,null,null,null,null,null,null,0,null,"","","",""]
[null,null,null,null,null,null,null,null,0,null,"","","",""]
[null,null,null,null,null,null,null,null,0,null,"","","",""]
[null,null,null,null,null,null,null,null,0,null,"","","",""]
[null,null,null,null,null,null,null,null,0,null,"","","",""]
[null,null,null,null,null,null,null,null,0,null,"","","",""]
[null,null,null,null,null,null,null,null,0,null,"","","",""]
[null,null,null,null,null,null,null,null,0,null,"","","",""]
[null,null,null,null,null,null,null,null,0,null,"","","",""]
[null,null,null,null,null,null,null,null,0,null,"","","",""]
[null,null,null,null,null,null,null,null,0,null,"","","",""]
[null,null,null,null,null,null,null,null,0,null,"","","",""]
[null,null,null,null,null,null,null,null,0,null,"","","",""]
[null,null,null,null,null,null,null,null,0,null,"","","",""]
[null,null,null,null,null,null,null,null,0,null,"","","",""]
[null,null,null,null,null,null,null,null,0,null,"","","",""]
[null,null,null,null,null,null,null,null,0,null,"","","",""]
[null,null,null,null,null,null,null,null,0,null,"","","",""]
[null,null,null,null,null,null,null,null,0,null,"","","",""]
[null,null,null,null,null,null,null,null,0,null,"","","",""]
[null,null,null,null,null,null,null,null,0,null,"","","",""]
[null,null,null,null,null,null,null,null,0,null,"","","",""]
[null,null,null,null,null,null,null,null,0,null,"","","",""]
[null,null,null,null,null,null,null,null,0,null,"","","",""]
[null,null,null,null,null,null,null,null,0,null,"","","",""]
[null,null,null,null,null,null,null,null,0,null,"","","",""]
[null,null,null,null,null,null,null,null,0,null,"","","",""]
[null,null,null,null,null,null,null,null,0,null,"","","",""]
[null,null,null,null,null,null,null,null,0,null,"","","",""]
[null,null,null,null,null,null,null,null,0,null,"","","",""]
[null,null,null,null,null,null,null,null,0,null,"","","",""]
[null,null,null,null,null,null,null,null,0,null,"","","",""]
[null,null,null,null,null,null,null,null,0,null,"","","",""]
[null,null,null,null,null,null,null,null,0,null,"","","",""]
[null,null,null,null,null,null,null,null,0,null,"","","",""]
[null,null,null,null,null,null,null,null,0,null,"","","",""]
[null,null,null,null,null,null,null,null,0,null,"","","",""]
[null,null,null,null,null,null,null,null,0,null,"","","",""]
[null,null,null,null,null,null,null,null,0,null,"","","",""]
[null,null,null,null,null,null,null,null,0,null,"","","",""]
[null,null,null,null,null,null,null,null,0,null,"","","",""]
[null,null,null,null,null,null,null,null,0,null,"","","",""]
[null,null,null,null,null,null,null,null,0,null,"","","",""]
[null,null,null,null,null,null,null,null,0,null,"","","",""]
[null,null,null,null,null,null,null,null,0,null,"","","",""]
[null,null,null,null,null,null,null,null,0,null,"","","",""]
[null,null,null,null,null,null,null,null,0,null,"","","",""]
[null,null,null,null,null,null,null,null,0,null,"","","",""]
[null,null,null,null,null,null,null,null,0,null,"","","",""]
[null,null,null,null,null,null,null,null,0,null,"","","",""]
[null,null,null,null,null,null,null,null,0,null,"","","",""]
[null,null,null,null,null,null,null,null,0,null,"","","",""]
[null,null,null,null,null,null,null,null,0,null,"","","",""]
[null,null,null,null,null,null,null,null,0,null,"","","",""]
[null,null,null,null,null,null,null,null,0,null,"","","",""]
[null,null,null,null,null,null,null,null,0,null,"","","",""]
[null,null,null,null,null,null,null,null,0,null,"","","",""]
[null,null,null,null,null,null,null,null,0,null,"","","",""]
[null,null,null,null,null,null,null,null,0,null,"","","",""]
[null,null,null,null,null,null,null,null,0,null,"","","",""]
[null,null,null,null,null,null,null,null,0,null,"","","",""]
[null,null,null,null,null,null,null,null,0,null,"","","",""]
[null,null,null,null,null,null,null,null,0,null,"","","",""]
[null,null,null,null,null,null,null,null,{"$f":"IFERROR(G3303+H3303,\"\")","v":0},null,{"$f":"IFERROR(IF(J3303<>\"\",F3303*J3303,\"\"),\"\")","v":""},{"$f":"IFERROR(IF(J3303<>\"\",G3303*J3303,\"\"),\"\")","v":""},{"$f":"IFERROR(IF(J3303<>\"\",H3303*J3303,\"\"),\"\")","v":""},{"$f":"IFERROR(L3303+M3303,\"\")","v":""}]
[null,null,null,null,null,null,null,null,0,null,"","","",""]
[null,null,null,null,null,null,null,null,0,null,"","","",""]
[null,null,null,null,null,null,null,null,0,null,"","","",""]
[null,null,null,null,null,null,null,null,0,null,"","","",""]
[null,null,null,null,null,null,null,null,0,null,"","","",""]
[null,null,null,null,null,null,null,null,0,null,"","","",""]
[null,null,null,null,null,null,null,null,0,null,"","","",""]
[null,null,null,null,null,null,null,null,0,null,"","","",""]
[null,null,null,null,null,null,null,null,0,null,"","","",""]
[null,null,null,null,null,null,null,null,0,null,"","","",""]
[null,null,null,null,null,null,null,null,0,null,"","","",""]
[null,null,null,null,null,null,null,null,0,null,"","","",""]
[null,null,null,null,null,null,null,null,0,null,"","","",""]
[null,null,null,null,null,null,null,null,0,null,"","","",""]
[null,null,null,null,null,null,null,null,0,null,"","","",""]
[null,null,null,null,null,null,null,null,0,null,"","","",""]
[null,null,null,null,null,null,null,null,0,null,"","","",""]
[null,null,null,null,null,null,null,null,0,null,"","","",""]
[null,null,null,null,null,null,null,null,0,null,"","","",""]
[null,null,null,null,null,null,null,null,0,null,"","","",""]
[null,null,null,null,null,null,null,null,0,null,"","","",""]
[null,null,null,null,null,null,null,null,0,null,"","","",""]
[null,null,null,null,null,null,null,null,0,null,"","","",""]
[null,null,null,null,null,null,null,null,0,null,"","","",""]
[null,null,null,null,null,null,null,null,0,null,"","","",""]
[null,null,null,null,null,null,null,null,0,null,"","","",""]
[null,null,null,null,null,null,null,null,0,null,"","","",""]
[null,null,null,null,null,null,null,null,0,null,"","","",""]
[null,null,null,null,null,null,null,null,0,null,"","","",""]
[null,null,null,null,null,null,null,null,0,null,"","","",""]
[null,null,null,null,null,null,null,null,0,null,"","","",""]
[null,null,null,null,null,null,null,null,0,null,"","","",""]
[null,null,null,null,null,null,null,null,0,null,"","","",""]
[null,null,null,null,null,null,null,null,0,null,"","","",""]
[null,null,null,null,null,null,null,null,0,null,"","","",""]
[null,null,null,null,null,null,null,null,0,null,"","","",""]
[null,null,null,null,null,null,null,null,0,null,"","","",""]
[null,null,null,null,null,null,null,null,0,null,"","","",""]
[null,null,null,null,null,null,null,null,0,null,"","","",""]
[null,null,null,null,null,null,null,null,0,null,"","","",""]
[null,null,null,null,null,null,null,null,0,null,"","","",""]
[null,null,null,null,null,null,null,null,0,null,"","","",""]
[null,null,null,null,null,null,null,null,0,null,"","","",""]
[null,null,null,null,null,null,null,null,0,null,"","","",""]
[null,null,null,null,null,null,null,null,0,null,"","","",""]
[null,null,null,null,null,null,null,null,0,null,"","","",""]
[null,null,null,null,null,null,null,null,0,null,"","","",""]
[null,null,null,null,null,null,null,null,0,null,"","","",""]
[null,null,null,null,null,null,null,null,0,null,"","","",""]
[null,null,null,null,null,null,null,null,0,null,"","","",""]
[null,null,null,null,null,null,null,null,0,null,"","","",""]
[null,null,null,null,null,null,null,null,0,null,"","","",""]
[null,null,null,null,null,null,null,null,0,null,"","","",""]
[null,null,null,null,null,null,null,null,0,null,"","","",""]
[null,null,null,null,null,null,null,null,0,null,"","","",""]
[null,null,null,null,null,null,null,null,0,null,"","","",""]
[null,null,null,null,null,null,null,null,0,null,"","","",""]
[null,null,null,null,null,null,null,null,0,null,"","","",""]
[null,null,null,null,null,null,null,null,0,null,"","","",""]
[null,null,null,null,null,null,null,null,0,null,"","","",""]
[null,null,null,null,null,null,null,null,0,null,"","","",""]
[null,null,null,null,null,null,null,null,0,null,"","","",""]
[null,null,null,null,null,null,null,null,0,null,"","","",""]
[null,null,null,null,null,null,null,null,{"$f":"IFERROR(G3367+H3367,\"\")","v":0},null,{"$f":"IFERROR(IF(J3367<>\"\",F3367*J3367,\"\"),\"\")","v":""},{"$f":"IFERROR(IF(J3367<>\"\",G3367*J3367,\"\"),\"\")","v":""},{"$f":"IFERROR(IF(J3367<>\"\",H3367*J3367,\"\"),\"\")","v":""},{"$f":"IFERROR(L3367+M3367,\"\")","v":""}]
[null,null,null,null,null,null,null,null,0,null,"","","",""]
[null,null,null,null,null,null,null,null,0,null,"","","",""]
[null,null,null,null,null,null,null,null,0,null,"","","",""]
[null,null,null,null,null,null,null,null,0,null,"","","",""]
[null,null,null,null,null,null,null,null,0,null,"","","",""]
[null,null,null,null,null,null,null,null,0,null,"","","",""]
[null,null,null,null,null,null,null,null,0,null,"","","",""]
[null,null,null,null,null,null,null,null,0,null,"","","",""]
[null,null,null,null,null,null,null,null,0,null,"","","",""]
[null,null,null,null,null,null,null,null,0,null,"","","",""]
[null,null,null,null,null,null,null,null,0,null,"","","",""]
[null,null,null,null,null,null,null,null,0,null,"","","",""]
[null,null,null,null,null,null,null,null,0,null,"","","",""]
[null,null,null,null,null,null,null,null,0,null,"","","",""]
[null,null,null,null,null,null,null,null,0,null,"","","",""]
[null,null,null,null,null,null,null,null,0,null,"","","",""]
[null,null,null,null,null,null,null,null,0,null,"","","",""]
[null,null,null,null,null,null,null,null,0,null,"","","",""]
[null,null,null,null,null,null,null,null,0,null,"","","",""]
[null,null,null,null,null,null,null,null,0,null,"","","",""]
[null,null,null,null,null,null,null,null,0,null,"","","",""]
[null,null,null,null,null,null,null,null,0,null,"","","",""]
[null,null,null,null,null,null,null,null,0,null,"","","",""]
[null,null,null,null,null,null,null,null,0,null,"","","",""]
[null,null,null,null,null,null,null,null,0,null,"","","",""]
[null,null,null,null,null,null,null,null,0,null,"","","",""]
[null,null,null,null,null,null,null,null,0,null,"","","",""]
[null,null,null,null,null,null,null,null,0,null,"","","",""]
[null,null,null,null,null,null,null,null,0,null,"","","",""]
[null,null,null,null,null,null,null,null,0,null,"","","",""]
[null,null,null,null,null,null,null,null,0,null,"","","",""]
[null,null,null,null,null,null,null,null,0,null,"","","",""]
[null,null,null,null,null,null,null,null,0,null,"","","",""]
[null,null,null,null,null,null,null,null,0,null,"","","",""]
[null,null,null,null,null,null,null,null,0,null,"","","",""]
[null,null,null,null,null,null,null,null,0,null,"","","",""]
[null,null,null,null,null,null,null,null,0,null,"","","",""]
[null,null,null,null,null,null,null,null,0,null,"","","",""]
[null,null,null,null,null,null,null,null,0,null,"","","",""]
[null,null,null,null,null,null,null,null,0,null,"","","",""]
[null,null,null,null,null,null,null,null,0,null,"","","",""]
[null,null,null,null,null,null,null,null,0,null,"","","",""]
[null,null,null,null,null,null,null,null,0,null,"","","",""]
[null,null,null,null,null,null,null,null,0,null,"","","",""]
[null,null,null,null,null,null,null,null,0,null,"","","",""]
[null,null,null,null,null,null,null,null,0,null,"","","",""]
[null,null,null,null,null,null,null,null,0,null,"","","",""]
[null,null,null,null,null,null,null,null,0,null,"","","",""]
[null,null,null,null,null,null,null,null,0,null,"","","",""]
[null,null,null,null,null,null,null,null,0,null,"","","",""]
[null,null,null,null,null,null,null,null,0,null,"","","",""]
[null,null,null,null,null,null,null,null,0,null,"","","",""]
[null,null,null,null,null,null,null,null,0,null,"","","",""]
[null,null,null,null,null,null,null,null,0,null,"","","",""]
[null,null,null,null,null,null,null,null,0,null,"","","",""]
[null,null,null,null,null,null,null,null,0,null,"","","",""]
[null,null,null,null,null,null,null,null,0,null,"","","",""]
[null,null,null,null,null,null,null,null,0,null,"","","",""]
[null,null,null,null,null,null,null,null,0,null,"","","",""]
[null,null,null,null,null,null,null,null,0,null,"","","",""]
[null,null,null,null,null,null,null,null,0,null,"","","",""]
[null,null,null,null,null,null,null,null,0,null,"","","",""]
[null,null,null,null,null,null,null,null,0,null,"","","",""]
[null,null,null,null,null,null,null,null,{"$f":"IFERROR(G3431+H3431,\"\")","v":0},null,{"$f":"IFERROR(IF(J3431<>\"\",F3431*J3431,\"\"),\"\")","v":""},{"$f":"IFERROR(IF(J3431<>\"\",G3431*J3431,\"\"),\"\")","v":""},{"$f":"IFERROR(IF(J3431<>\"\",H3431*J3431,\"\"),\"\")","v":""},{"$f":"IFERROR(L3431+M3431,\"\")","v":""}]
[null,null,null,null,null,null,null,null,0,null,"","","",""]
[null,null,null,null,null,null,null,null,0,null,"","","",""]
[null,null,null,null,null,null,null,null,0,null,"","","",""]
[null,null,null,null,null,null,null,null,0,null,"","","",""]
[null,null,null,null,null,null,null,null,0,null,"","","",""]
[null,null,null,null,null,null,null,null,0,null,"","","",""]
[null,null,null,null,null,null,null,null,0,null,"","","",""]
[null,null,null,null,null,null,null,null,0,null,"","","",""]
[null,null,null,null,null,null,null,null,0,null,"","","",""]
[null,null,null,null,null,null,null,null,0,null,"","","",""]
[null,null,null,null,null,null,null,null,0,null,"","","",""]
[null,null,null,null,null,null,null,null,0,null,"","","",""]
[null,null,null,null,null,null,null,null,0,null,"","","",""]
[null,null,null,null,null,null,null,null,0,null,"","","",""]
[null,null,null,null,null,null,null,null,0,null,"","","",""]
[null,null,null,null,null,null,null,null,0,null,"","","",""]
[null,null,null,null,null,null,null,null,0,null,"","","",""]
[null,null,null,null,null,null,null,null,0,null,"","","",""]
[null,null,null,null,null,null,null,null,0,null,"","","",""]
[null,null,null,null,null,null,null,null,0,null,"","","",""]
[null,null,null,null,null,null,null,null,0,null,"","","",""]
[null,null,null,null,null,null,null,null,0,null,"","","",""]
[null,null,null,null,null,null,null,null,0,null,"","","",""]
[null,null,null,null,null,null,null,null,0,null,"","","",""]
[null,null,null,null,null,null,null,null,0,null,"","","",""]
[null,null,null,null,null,null,null,null,0,null,"","","",""]
[null,null,null,null,null,null,null,null,0,null,"","","",""]
[null,null,null,null,null,null,null,null,0,null,"","","",""]
[null,null,null,null,null,null,null,null,0,null,"","","",""]
[null,null,null,null,null,null,null,null,0,null,"","","",""]
[null,null,null,null,null,null,null,null,0,null,"","","",""]
[null,null,null,null,null,null,null,null,0,null,"","","",""]
[null,null,null,null,null,null,null,null,0,null,"","","",""]
[null,null,null,null,null,null,null,null,0,null,"","","",""]
[null,null,null,null,null,null,null,null,0,null,"","","",""]
[null,null,null,null,null,null,null,null,0,null,"","","",""]
[null,null,null,null,null,null,null,null,0,null,"","","",""]
[null,null,null,null,null,null,null,null,0,null,"","","",""]
[null,null,null,null,null,null,null,null,0,null,"","","",""]
[null,null,null,null,null,null,null,null,0,null,"","","",""]
[null,null,null,null,null,null,null,null,0,null,"","","",""]
[null,null,null,null,null,null,null,null,0,null,"","","",""]
[null,null,null,null,null,null,null,null,0,null,"","","",""]
[null,null,null,null,null,null,null,null,0,null,"","","",""]
[null,null,null,null,null,null,null,null,0,null,"","","",""]
[null,null,null,null,null,null,null,null,0,null,"","","",""]
[null,null,null,null,null,null,null,null,0,null,"","","",""]
[null,null,null,null,null,null,null,null,0,null,"","","",""]
[null,null,null,null,null,null,null,null,0,null,"","","",""]
[null,null,null,null,null,null,null,null,0,null,"","","",""]
[null,null,null,null,null,null,null,null,0,null,"","","",""]
[null,null,null,null,null,null,null,null,0,null,"","","",""]
[null,null,null,null,null,null,null,null,0,null,"","","",""]
[null,null,null,null,null,null,null,null,0,null,"","","",""]
[null,null,null,null,null,null,null,null,0,null,"","","",""]
[null,null,null,null,null,null,null,null,0,null,"","","",""]
[null,null,null,null,null,null,null,null,0,null,"","","",""]
[null,null,null,null,null,null,null,null,0,null,"","","",""]
[null,null,null,null,null,null,null,null,0,null,"","","",""]
[null,null,null,null,null,null,null,null,0,null,"","","",""]
[null,null,null,null,null,null,null,null,0,null,"","","",""]
[null,null,null,null,null,null,null,null,0,null,"","","",""]
[null,null,null,null,null,null,null,null,0,null,"","","",""]
[null,null,null,null,null,null,null,null,{"$f":"IFERROR(G3495+H3495,\"\")","v":0},null,{"$f":"IFERROR(IF(J3495<>\"\",F3495*J3495,\"\"),\"\")","v":""},{"$f":"IFERROR(IF(J3495<>\"\",G3495*J3495,\"\"),\"\")","v":""},{"$f":"IFERROR(IF(J3495<>\"\",H3495*J3495,\"\"),\"\")","v":""},{"$f":"IFERROR(L3495+M3495,\"\")","v":""}]
[null,null,null,null,null,null,null,null,0,null,"","","",""]
[null,null,null,null,null,null,null,null,0,null,"","","",""]
[null,null,null,null,null,null,null,null,0,null,"","","",""]
[null,null,null,null,null,null,null,null,0,null,"","","",""]
[null,null,null,null,null,null,null,null,0,null,"","","",""]
[null,null,null,null,null,null,null,null,0,null,"","","",""]
[null,null,null,null,null,null,null,null,0,null,"","","",""]
[null,null,null,null,null,null,null,null,0,null,"","","",""]
[null,null,null,null,null,null,null,null,0,null,"","","",""]
[null,null,null,null,null,null,null,null,0,null,"","","",""]
[null,null,null,null,null,null,null,null,0,null,"","","",""]
[null,null,null,null,null,null,null,null,0,null,"","","",""]
[null,null,null,null,null,null,null,null,0,null,"","","",""]
[null,null,null,null,null,null,null,null,0,null,"","","",""]
[null,null,null,null,null,null,null,null,0,null,"","","",""]
[null,null,null,null,null,null,null,null,0,null,"","","",""]
[null,null,null,null,null,null,null,null,0,null,"","","",""]
[null,null,null,null,null,null,null,null,0,null,"","","",""]
[null,null,null,null,null,null,null,null,0,null,"","","",""]
[null,null,null,null,null,null,null,null,0,null,"","","",""]
[null,null,null,null,null,null,null,null,0,null,"","","",""]
[null,null,null,null,null,null,null,null,0,null,"","","",""]
[null,null,null,null,null,null,null,null,0,null,"","","",""]
[null,null,null,null,null,null,null,null,0,null,"","","",""]
[null,null,null,null,null,null,null,null,0,null,"","","",""]
[null,null,null,null,null,null,null,null,0,null,"","","",""]
[null,null,null,null,null,null,null,null,0,null,"","","",""]
[null,null,null,null,null,null,null,null,0,null,"","","",""]
[null,null,null,null,null,null,null,null,0,null,"","","",""]
[null,null,null,null,null,null,null,null,0,null,"","","",""]
[null,null,null,null,null,null,null,null,0,null,"","","",""]
[null,null,null,null,null,null,null,null,0,null,"","","",""]
[null,null,null,null,null,null,null,null,0,null,"","","",""]
[null,null,null,null,null,null,null,null,0,null,"","","",""]
[null,null,null,null,null,null,null,null,0,null,"","","",""]
[null,null,null,null,null,null,null,null,0,null,"","","",""]
[null,null,null,null,null,null,null,null,0,null,"","","",""]
[null,null,null,null,null,null,null,null,0,null,"","","",""]
[null,null,null,null,null,null,null,null,0,null,"","","",""]
[null,null,null,null,null,null,null,null,0,null,"","","",""]
[null,null,null,null,null,null,null,null,0,null,"","","",""]
[null,null,null,null,null,null,null,null,0,null,"","","",""]
[null,null,null,null,null,null,null,null,0,null,"","","",""]
[null,null,null,null,null,null,null,null,0,null,"","","",""]
[null,null,null,null,null,null,null,null,0,null,"","","",""]
[null,null,null,null,null,null,null,null,0,null,"","","",""]
[null,null,null,null,null,null,null,null,0,null,"","","",""]
[null,null,null,null,null,null,null,null,0,null,"","","",""]
[null,null,null,null,null,null,null,null,0,null,"","","",""]
[null,null,null,null,null,null,null,null,0,null,"","","",""]
[null,null,null,null,null,null,null,null,0,null,"","","",""]
[null,null,null,null,null,null,null,null,0,null,"","","",""]
[null,null,null,null,null,null,null,null,0,null,"","","",""]
[null,null,null,null,null,null,null,null,0,null,"","","",""]
[null,null,null,null,null,null,null,null,0,null,"","","",""]
[null,null,null,null,null,null,null,null,0,null,"","","",""]
[null,null,null,null,null,null,null,null,0,null,"","","",""]
[null,null,null,null,null,null,null,null,0,null,"","","",""]
[null,null,null,null,null,null,null,null,0,null,"","","",""]
[null,null,null,null,null,null,null,null,0,null,"","","",""]
[null,null,null,null,null,null,null,null,0,null,"","","",""]
[null,null,null,null,null,null,null,null,0,null,"","","",""]
[null,null,null,null,null,null,null,null,0,null,"","","",""]
[null,null,null,null,null,null,null,null,{"$f":"IFERROR(G3559+H3559,\"\")","v":0},null,{"$f":"IFERROR(IF(J3559<>\"\",F3559*J3559,\"\"),\"\")","v":""},{"$f":"IFERROR(IF(J3559<>\"\",G3559*J3559,\"\"),\"\")","v":""},{"$f":"IFERROR(IF(J3559<>\"\",H3559*J3559,\"\"),\"\")","v":""},{"$f":"IFERROR(L3559+M3559,\"\")","v":""}]
[null,null,null,null,null,null,null,null,0,null,"","","",""]
[null,null,null,null,null,null,null,null,0,null,"","","",""]
[null,null,null,null,null,null,null,null,0,null,"","","",""]
[null,null,null,null,null,null,null,null,0,null,"","","",""]
[null,null,null,null,null,null,null,null,0,null,"","","",""]
[null,null,null,null,null,null,null,null,0,null,"","","",""]
[null,null,null,null,null,null,null,null,0,null,"","","",""]
[null,null,null,null,null,null,null,null,0,null,"","","",""]
[null,null,null,null,null,null,null,null,0,null,"","","",""]
[null,null,null,null,null,null,null,null,0,null,"","","",""]
[null,null,null,null,null,null,null,null,0,null,"","","",""]
[null,null,null,null,null,null,null,null,0,null,"","","",""]
[null,null,null,null,null,null,null,null,0,null,"","","",""]
[null,null,null,null,null,null,null,null,0,null,"","","",""]
[null,null,null,null,null,null,null,null,0,null,"","","",""]
[null,null,null,null,null,null,null,null,0,null,"","","",""]
[null,null,null,null,null,null,null,null,0,null,"","","",""]
[null,null,null,null,null,null,null,null,0,null,"","","",""]
[null,null,null,null,null,null,null,null,0,null,"","","",""]
[null,null,null,null,null,null,null,null,0,null,"","","",""]
[null,null,null,null,null,null,null,null,0,null,"","","",""]
[null,null,null,null,null,null,null,null,0,null,"","","",""]
[null,null,null,null,null,null,null,null,0,null,"","","",""]
[null,null,null,null,null,null,null,null,0,null,"","","",""]
[null,null,null,null,null,null,null,null,0,null,"","","",""]
[null,null,null,null,null,null,null,null,0,null,"","","",""]
[null,null,null,null,null,null,null,null,0,null,"","","",""]
[null,null,null,null,null,null,null,null,0,null,"","","",""]
[null,null,null,null,null,null,null,null,0,null,"","","",""]
[null,null,null,null,null,null,null,null,0,null,"","","",""]
[null,null,null,null,null,null,null,null,0,null,"","","",""]
[null,null,null,null,null,null,null,null,0,null,"","","",""]
[null,null,null,null,null,null,null,null,0,null,"","","",""]
[null,null,null,null,null,null,null,null,0,null,"","","",""]
[null,null,null,null,null,null,null,null,0,null,"","","",""]
[null,null,null,null,null,null,null,null,0,null,"","","",""]
[null,null,null,null,null,null,null,null,0,null,"","","",""]
[null,null,null,null,null,null,null,null,0,null,"","","",""]
[null,null,null,null,null,null,null,null,0,null,"","","",""]
[null,null,null,null,null,null,null,null,0,null,"","","",""]
[null,null,null,null,null,null,null,null,0,null,"","","",""]
[null,null,null,null,null,null,null,null,0,null,"","","",""]
[null,null,null,null,null,null,null,null,0,null,"","","",""]
[null,null,null,null,null,null,null,null,0,null,"","","",""]
[null,null,null,null,null,null,null,null,0,null,"","","",""]
[null,null,null,null,null,null,null,null,0,null,"","","",""]
[null,null,null,null,null,null,null,null,0,null,"","","",""]
[null,null,null,null,null,null,null,null,0,null,"","","",""]
[null,null,null,null,null,null,null,null,0,null,"","","",""]
[null,null,null,null,null,null,null,null,0,null,"","","",""]
[null,null,null,null,null,null,null,null,0,null,"","","",""]
[null,null,null,null,null,null,null,null,0,null,"","","",""]
[null,null,null,null,null,null,null,null,0,null,"","","",""]
[null,null,null,null,null,null,null,null,0,null,"","","",""]
[null,null,null,null,null,null,null,null,0,null,"","","",""]
[null,null,null,null,null,null,null,null,0,null,"","","",""]
[null,null,null,null,null,null,null,null,0,null,"","","",""]
[null,null,null,null,null,null,null,null,0,null,"","","",""]
[null,null,null,null,null,null,null,null,0,null,"","","",""]
[null,null,null,null,null,null,null,null,0,null,"","","",""]
[null,null,null,null,null,null,null,null,0,null,"","","",""]
[null,null,null,null,null,null,null,null,0,null,"","","",""]
[null,null,null,null,null,null,null,null,0,null,"","","",""]
[null,null,null,null,null,null,null,null,{"$f":"IFERROR(G3623+H3623,\"\")","v":0},null,{"$f":"IFERROR(IF(J3623<>\"\",F3623*J3623,\"\"),\"\")","v":""},{"$f":"IFERROR(IF(J3623<>\"\",G3623*J3623,\"\"),\"\")","v":""},{"$f":"IFERROR(IF(J3623<>\"\",H3623*J3623,\"\"),\"\")","v":""},{"$f":"IFERROR(L3623+M3623,\"\")","v":""}]
[null,null,null,null,null,null,null,null,0,null,"","","",""]
[null,null,null,null,null,null,null,null,0,null,"","","",""]
[null,null,null,null,null,null,null,null,0,null,"","","",""]
[null,null,null,null,null,null,null,null,0,null,"","","",""]
[null,null,null,null,null,null,null,null,0,null,"","","",""]
[null,null,null,null,null,null,null,null,0,null,"","","",""]
[null,null,null,null,null,null,null,null,0,null,"","","",""]
[null,null,null,null,null,null,null,null,0,null,"","","",""]
[null,null,null,null,null,null,null,null,0,null,"","","",""]
[null,null,null,null,null,null,null,null,0,null,"","","",""]
[null,null,null,null,null,null,null,null,0,null,"","","",""]
[null,null,null,null,null,null,null,null,0,null,"","","",""]
[null,null,null,null,null,null,null,null,0,null,"","","",""]
[null,null,null,null,null,null,null,null,0,null,"","","",""]
[null,null,null,null,null,null,null,null,0,null,"","","",""]
[null,null,null,null,null,null,null,null,0,null,"","","",""]
[null,null,null,null,null,null,null,null,0,null,"","","",""]
[null,null,null,null,null,null,null,null,0,null,"","","",""]
[null,null,null,null,null,null,null,null,0,null,"","","",""]
[null,null,null,null,null,null,null,null,0,null,"","","",""]
[null,null,null,null,null,null,null,null,0,null,"","","",""]
[null,null,null,null,null,null,null,null,0,null,"","","",""]
[null,null,null,null,null,null,null,null,0,null,"","","",""]
[null,null,null,null,null,null,null,null,0,null,"","","",""]
[null,null,null,null,null,null,null,null,0,null,"","","",""]
[null,null,null,null,null,null,null,null,0,null,"","","",""]
[null,null,null,null,null,null,null,null,0,null,"","","",""]
[null,null,null,null,null,null,null,null,0,null,"","","",""]
[null,null,null,null,null,null,null,null,0,null,"","","",""]
[null,null,null,null,null,null,null,null,0,null,"","","",""]
[null,null,null,null,null,null,null,null,0,null,"","","",""]
[null,null,null,null,null,null,null,null,0,null,"","","",""]
[null,null,null,null,null,null,null,null,0,null,"","","",""]
[null,null,null,null,null,null,null,null,0,null,"","","",""]
[null,null,null,null,null,null,null,null,0,null,"","","",""]
[null,null,null,null,null,null,null,null,0,null,"","","",""]
[null,null,null,null,null,null,null,null,0,null,"","","",""]
[null,null,null,null,null,null,null,null,0,null,"","","",""]
[null,null,null,null,null,null,null,null,0,null,"","","",""]
[null,null,null,null,null,null,null,null,0,null,"","","",""]
[null,null,null,null,null,null,null,null,0,null,"","","",""]
[null,null,null,null,null,null,null,null,0,null,"","","",""]
[null,null,null,null,null,null,null,null,0,null,"","","",""]
[null,null,null,null,null,null,null,null,0,null,"","","",""]
[null,null,null,null,null,null,null,null,0,null,"","","",""]
[null,null,null,null,null,null,null,null,0,null,"","","",""]
[null,null,null,null,null,null,null,null,0,null,"","","",""]
[null,null,null,null,null,null,null,null,0,null,"","","",""]
[null,null,null,null,null,null,null,null,0,null,"","","",""]
[null,null,null,null,null,null,null,null,0,null,"","","",""]
[null,null,null,null,null,null,null,null,0,null,"","","",""]
[null,null,null,null,null,null,null,null,0,null,"","","",""]
[null,null,null,null,null,null,null,null,0,null,"","","",""]
[null,null,null,null,null,null,null,null,0,null,"","","",""]
[null,null,null,null,null,null,null,null,0,null,"","","",""]
[null,null,null,null,null,null,null,null,0,null,"","","",""]
[null,null,null,null,null,null,null,null,0,null,"","","",""]
[null,null,null,null,null,null,null,null,0,null,"","","",""]
[null,null,null,null,null,null,null,null,0,null,"","","",""]
[null,null,null,null,null,null,null,null,0,null,"","","",""]
[null,null,null,null,null,null,null,null,0,null,"","","",""]
[null,null,null,null,null,null,null,null,0,null,"","","",""]
[null,null,null,null,null,null,null,null,0,null,"","","",""]
[null,null,null,null,null,null,null,null,{"$f":"IFERROR(G3687+H3687,\"\")","v":0},null,{"$f":"IFERROR(IF(J3687<>\"\",F3687*J3687,\"\"),\"\")","v":""},{"$f":"IFERROR(IF(J3687<>\"\",G3687*J3687,\"\"),\"\")","v":""},{"$f":"IFERROR(IF(J3687<>\"\",H3687*J3687,\"\"),\"\")","v":""},{"$f":"IFERROR(L3687+M3687,\"\")","v":""}]
[null,null,null,null,null,null,null,null,0,null,"","","",""]
[null,null,null,null,null,null,null,null,0,null,"","","",""]
[null,null,null,null,null,null,null,null,0,null,"","","",""]
[null,null,null,null,null,null,null,null,0,null,"","","",""]
[null,null,null,null,null,null,null,null,0,null,"","","",""]
[null,null,null,null,null,null,null,null,0,null,"","","",""]
[null,null,null,null,null,null,null,null,0,null,"","","",""]
[null,null,null,null,null,null,null,null,0,null,"","","",""]
[null,null,null,null,null,null,null,null,0,null,"","","",""]
[null,null,null,null,null,null,null,null,0,null,"","","",""]
[null,null,null,null,null,null,null,null,0,null,"","","",""]
[null,null,null,null,null,null,null,null,0,null,"","","",""]
[null,null,null,null,null,null,null,null,0,null,"","","",""]
[null,null,null,null,null,null,null,null,0,null,"","","",""]
[null,null,null,null,null,null,null,null,0,null,"","","",""]
[null,null,null,null,null,null,null,null,0,null,"","","",""]
[null,null,null,null,null,null,null,null,0,null,"","","",""]
[null,null,null,null,null,null,null,null,0,null,"","","",""]
[null,null,null,null,null,null,null,null,0,null,"","","",""]
[null,null,null,null,null,null,null,null,0,null,"","","",""]
[null,null,null,null,null,null,null,null,0,null,"","","",""]
[null,null,null,null,null,null,null,null,0,null,"","","",""]
[null,null,null,null,null,null,null,null,0,null,"","","",""]
[null,null,null,null,null,null,null,null,0,null,"","","",""]
[null,null,null,null,null,null,null,null,0,null,"","","",""]
[null,null,null,null,null,null,null,null,0,null,"","","",""]
[null,null,null,null,null,null,null,null,0,null,"","","",""]
[null,null,null,null,null,null,null,null,0,null,"","","",""]
[null,null,null,null,null,null,null,null,0,null,"","","",""]
[null,null,null,null,null,null,null,null,0,null,"","","",""]
[null,null,null,null,null,null,null,null,0,null,"","","",""]
[null,null,null,null,null,null,null,null,0,null,"","","",""]
[null,null,null,null,null,null,null,null,0,null,"","","",""]
[null,null,null,null,null,null,null,null,0,null,"","","",""]
[null,null,null,null,null,null,null,null,0,null,"","","",""]
[null,null,null,null,null,null,null,null,0,null,"","","",""]
[null,null,null,null,null,null,null,null,0,null,"","","",""]
[null,null,null,null,null,null,null,null,0,null,"","","",""]
[null,null,null,null,null,null,null,null,0,null,"","","",""]
[null,null,null,null,null,null,null,null,0,null,"","","",""]
[null,null,null,null,null,null,null,null,0,null,"","","",""]
[null,null,null,null,null,null,null,null,0,null,"","","",""]
[null,null,null,null,null,null,null,null,0,null,"","","",""]
[null,null,null,null,null,null,null,null,0,null,"","","",""]
[null,null,null,null,null,null,null,null,0,null,"","","",""]
[null,null,null,null,null,null,null,null,0,null,"","","",""]
[null,null,null,null,null,null,null,null,0,null,"","","",""]
[null,null,null,null,null,null,null,null,0,null,"","","",""]
[null,null,null,null,null,null,null,null,0,null,"","","",""]
[null,null,null,null,null,null,null,null,0,null,"","","",""]
[null,null,null,null,null,null,null,null,0,null,"","","",""]
[null,null,null,null,null,null,null,null,0,null,"","","",""]
[null,null,null,null,null,null,null,null,0,null,"","","",""]
[null,null,null,null,null,null,null,null,0,null,"","","",""]
[null,null,null,null,null,null,null,null,0,null,"","","",""]
[null,null,null,null,null,null,null,null,0,null,"","","",""]
[null,null,null,null,null,null,null,null,0,null,"","","",""]
[null,null,null,null,null,null,null,null,0,null,"","","",""]
[null,null,null,null,null,null,null,null,0,null,"","","",""]
[null,null,null,null,null,null,null,null,0,null,"","","",""]
[null,null,null,null,null,null,null,null,0,null,"","","",""]
[null,null,null,null,null,null,null,null,0,null,"","","",""]
[null,null,null,null,null,null,null,null,0,null,"","","",""]
[null,null,null,null,null,null,null,null,{"$f":"IFERROR(G3751+H3751,\"\")","v":0},null,{"$f":"IFERROR(IF(J3751<>\"\",F3751*J3751,\"\"),\"\")","v":""},{"$f":"IFERROR(IF(J3751<>\"\",G3751*J3751,\"\"),\"\")","v":""},{"$f":"IFERROR(IF(J3751<>\"\",H3751*J3751,\"\"),\"\")","v":""},{"$f":"IFERROR(L3751+M3751,\"\")","v":""}]
[null,null,null,null,null,null,null,null,0,null,"","","",""]
[null,null,null,null,null,null,null,null,0,null,"","","",""]
[null,null,null,null,null,null,null,null,0,null,"","","",""]
[null,null,null,null,null,null,null,null,0,null,"","","",""]
[null,null,null,null,null,null,null,null,0,null,"","","",""]
[null,null,null,null,null,null,null,null,0,null,"","","",""]
[null,null,null,null,null,null,null,null,0,null,"","","",""]
[null,null,null,null,null,null,null,null,0,null,"","","",""]
[null,null,null,null,null,null,null,null,0,null,"","","",""]
[null,null,null,null,null,null,null,null,0,null,"","","",""]
[null,null,null,null,null,null,null,null,0,null,"","","",""]
[null,null,null,null,null,null,null,null,0,null,"","","",""]
[null,null,null,null,null,null,null,null,0,null,"","","",""]
[null,null,null,null,null,null,null,null,0,null,"","","",""]
[null,null,null,null,null,null,null,null,0,null,"","","",""]
[null,null,null,null,null,null,null,null,0,null,"","","",""]
[null,null,null,null,null,null,null,null,0,null,"","","",""]
[null,null,null,null,null,null,null,null,0,null,"","","",""]
[null,null,null,null,null,null,null,null,0,null,"","","",""]
[null,null,null,null,null,null,null,null,0,null,"","","",""]
[null,null,null,null,null,null,null,null,0,null,"","","",""]
[null,null,null,null,null,null,null,null,0,null,"","","",""]
[null,null,null,null,null,null,null,null,0,null,"","","",""]
[null,null,null,null,null,null,null,null,0,null,"","","",""]
[null,null,null,null,null,null,null,null,0,null,"","","",""]
[null,null,null,null,null,null,null,null,0,null,"","","",""]
[null,null,null,null,null,null,null,null,0,null,"","","",""]
[null,null,null,null,null,null,null,null,0,null,"","","",""]
[null,null,null,null,null,null,null,null,0,null,"","","",""]
[null,null,null,null,null,null,null,null,0,null,"","","",""]
[null,null,null,null,null,null,null,null,0,null,"","","",""]
[null,null,null,null,null,null,null,null,0,null,"","","",""]
[null,null,null,null,null,null,null,null,0,null,"","","",""]
[null,null,null,null,null,null,null,null,0,null,"","","",""]
[null,null,null,null,null,null,null,null,0,null,"","","",""]
[null,null,null,null,null,null,null,null,0,null,"","","",""]
[null,null,null,null,null,null,null,null,0,null,"","","",""]
[null,null,null,null,null,null,null,null,0,null,"","","",""]
[null,null,null,null,null,null,null,null,0,null,"","","",""]
[null,null,null,null,null,null,null,null,0,null,"","","",""]
[null,null,null,null,null,null,null,null,0,null,"","","",""]
[null,null,null,null,null,null,null,null,0,null,"","","",""]
[null,null,null,null,null,null,null,null,0,null,"","","",""]
[null,null,null,null,null,null,null,null,0,null,"","","",""]
[null,null,null,null,null,null,null,null,0,null,"","","",""]
[null,null,null,null,null,null,null,null,0,null,"","","",""]
[null,null,null,null,null,null,null,null,0,null,"","","",""]
[null,null,null,null,null,null,null,null,0,null,"","","",""]
[null,null,null,null,null,null,null,null,0,null,"","","",""]
[null,null,null,null,null,null,null,null,0,null,"","","",""]
[null,null,null,null,null,null,null,null,0,null,"","","",""]
[null,null,null,null,null,null,null,null,0,null,"","","",""]
[null,null,null,null,null,null,null,null,0,null,"","","",""]
[null,null,null,null,null,null,null,null,0,null,"","","",""]
[null,null,null,null,null,null,null,null,0,null,"","","",""]
[null,null,null,null,null,null,null,null,0,null,"","","",""]
[null,null,null,null,null,null,null,null,0,null,"","","",""]
[null,null,null,null,null,null,null,null,0,null,"","","",""]
[null,null,null,null,null,null,null,null,0,null,"","","",""]
[null,null,null,null,null,null,null,null,0,null,"","","",""]
[null,null,null,null,null,null,null,null,0,null,"","","",""]
[null,null,null,null,null,null,null,null,0,null,"","","",""]
[null,null,null,null,null,null,null,null,0,null,"","","",""]
[null,null,null,null,null,null,null,null,{"$f":"IFERROR(G3815+H3815,\"\")","v":0},null,{"$f":"IFERROR(IF(J3815<>\"\",F3815*J3815,\"\"),\"\")","v":""},{"$f":"IFERROR(IF(J3815<>\"\",G3815*J3815,\"\"),\"\")","v":""},{"$f":"IFERROR(IF(J3815<>\"\",H3815*J3815,\"\"),\"\")","v":""},{"$f":"IFERROR(L3815+M3815,\"\")","v":""}]
[null,null,null,null,null,null,null,null,0,null,"","","",""]
[null,null,null,null,null,null,null,null,0,null,"","","",""]
[null,null,null,null,null,null,null,null,0,null,"","","",""]
[null,null,null,null,null,null,null,null,0,null,"","","",""]
[null,null,null,null,null,null,null,null,0,null,"","","",""]
[null,null,null,null,null,null,null,null,0,null,"","","",""]
[null,null,null,null,null,null,null,null,0,null,"","","",""]
[null,null,null,null,null,null,null,null,0,null,"","","",""]
[null,null,null,null,null,null,null,null,0,null,"","","",""]
[null,null,null,null,null,null,null,null,0,null,"","","",""]
[null,null,null,null,null,null,null,null,0,null,"","","",""]
[null,null,null,null,null,null,null,null,0,null,"","","",""]
[null,null,null,null,null,null,null,null,0,null,"","","",""]
[null,null,null,null,null,null,null,null,0,null,"","","",""]
[null,null,null,null,null,null,null,null,0,null,"","","",""]
[null,null,null,null,null,null,null,null,0,null,"","","",""]
[null,null,null,null,null,null,null,null,0,null,"","","",""]
[null,null,null,null,null,null,null,null,0,null,"","","",""]
[null,null,null,null,null,null,null,null,0,null,"","","",""]
[null,null,null,null,null,null,null,null,0,null,"","","",""]
[null,null,null,null,null,null,null,null,0,null,"","","",""]
[null,null,null,null,null,null,null,null,0,null,"","","",""]
[null,null,null,null,null,null,null,null,0,null,"","","",""]
[null,null,null,null,null,null,null,null,0,null,"","","",""]
[null,null,null,null,null,null,null,null,0,null,"","","",""]
[null,null,null,null,null,null,null,null,0,null,"","","",""]
[null,null,null,null,null,null,null,null,0,null,"","","",""]
[null,null,null,null,null,null,null,null,0,null,"","","",""]
[null,null,null,null,null,null,null,null,0,null,"","","",""]
[null,null,null,null,null,null,null,null,0,null,"","","",""]
[null,null,null,null,null,null,null,null,0,null,"","","",""]
[null,null,null,null,null,null,null,null,0,null,"","","",""]
[null,null,null,null,null,null,null,null,0,null,"","","",""]
[null,null,null,null,null,null,null,null,0,null,"","","",""]
[null,null,null,null,null,null,null,null,0,null,"","","",""]
[null,null,null,null,null,null,null,null,0,null,"","","",""]
[null,null,null,null,null,null,null,null,0,null,"","","",""]
[null,null,null,null,null,null,null,null,0,null,"","","",""]
[null,null,null,null,null,null,null,null,0,null,"","","",""]
[null,null,null,null,null,null,null,null,0,null,"","","",""]
[null,null,null,null,null,null,null,null,0,null,"","","",""]
[null,null,null,null,null,null,null,null,0,null,"","","",""]
[null,null,null,null,null,null,null,null,0,null,"","","",""]
[null,null,null,null,null,null,null,null,0,null,"","","",""]
[null,null,null,null,null,null,null,null,0,null,"","","",""]
[null,null,null,null,null,null,null,null,0,null,"","","",""]
[null,null,null,null,null,null,null,null,0,null,"","","",""]
[null,null,null,null,null,null,null,null,0,null,"","","",""]
[null,null,null,null,null,null,null,null,0,null,"","","",""]
[null,null,null,null,null,null,null,null,0,null,"","","",""]
[null,null,null,null,null,null,null,null,0,null,"","","",""]
[null,null,null,null,null,null,null,null,0,null,"","","",""]
[null,null,null,null,null,null,null,null,0,null,"","","",""]
[null,null,null,null,null,null,null,null,0,null,"","","",""]
[null,null,null,null,null,null,null,null,0,null,"","","",""]
[null,null,null,null,null,null,null,null,0,null,"","","",""]
[null,null,null,null,null,null,null,null,0,null,"","","",""]
[null,null,null,null,null,null,null,null,0,null,"","","",""]
[null,null,null,null,null,null,null,null,0,null,"","","",""]
[null,null,null,null,null,null,null,null,0,null,"","","",""]
[null,null,null,null,null,null,null,null,0,null,"","","",""]
[null,null,null,null,null,null,null,null,0,null,"","","",""]
[null,null,null,null,null,null,null,null,0,null,"","","",""]
[null,null,null,null,null,null,null,null,{"$f":"IFERROR(G3879+H3879,\"\")","v":0},null,{"$f":"IFERROR(IF(J3879<>\"\",F3879*J3879,\"\"),\"\")","v":""},{"$f":"IFERROR(IF(J3879<>\"\",G3879*J3879,\"\"),\"\")","v":""},{"$f":"IFERROR(IF(J3879<>\"\",H3879*J3879,\"\"),\"\")","v":""},{"$f":"IFERROR(L3879+M3879,\"\")","v":""}]
[null,null,null,null,null,null,null,null,0,null,"","","",""]
[null,null,null,null,null,null,null,null,0,null,"","","",""]
[null,null,null,null,null,null,null,null,0,null,"","","",""]
[null,null,null,null,null,null,null,null,0,null,"","","",""]
[null,null,null,null,null,null,null,null,0,null,"","","",""]
[null,null,null,null,null,null,null,null,0,null,"","","",""]
[null,null,null,null,null,null,null,null,0,null,"","","",""]
[null,null,null,null,null,null,null,null,0,null,"","","",""]
[null,null,null,null,null,null,null,null,0,null,"","","",""]
[null,null,null,null,null,null,null,null,0,null,"","","",""]
[null,null,null,null,null,null,null,null,0,null,"","","",""]
[null,null,null,null,null,null,null,null,0,null,"","","",""]
[null,null,null,null,null,null,null,null,0,null,"","","",""]
[null,null,null,null,null,null,null,null,0,null,"","","",""]
[null,null,null,null,null,null,null,null,0,null,"","","",""]
[null,null,null,null,null,null,null,null,0,null,"","","",""]
[null,null,null,null,null,null,null,null,0,null,"","","",""]
[null,null,null,null,null,null,null,null,0,null,"","","",""]
[null,null,null,null,null,null,null,null,0,null,"","","",""]
[null,null,null,null,null,null,null,null,0,null,"","","",""]
[null,null,null,null,null,null,null,null,0,null,"","","",""]
[null,null,null,null,null,null,null,null,0,null,"","","",""]
[null,null,null,null,null,null,null,null,0,null,"","","",""]
[null,null,null,null,null,null,null,null,0,null,"","","",""]
[null,null,null,null,null,null,null,null,0,null,"","","",""]
[null,null,null,null,null,null,null,null,0,null,"","","",""]
[null,null,null,null,null,null,null,null,0,null,"","","",""]
[null,null,null,null,null,null,null,null,0,null,"","","",""]
[null,null,null,null,null,null,null,null,0,null,"","","",""]
[null,null,null,null,null,null,null,null,0,null,"","","",""]
[null,null,null,null,null,null,null,null,0,null,"","","",""]
[null,null,null,null,null,null,null,null,0,null,"","","",""]
[null,null,null,null,null,null,null,null,0,null,"","","",""]
[null,null,null,null,null,null,null,null,0,null,"","","",""]
[null,null,null,null,null,null,null,null,0,null,"","","",""]
[null,null,null,null,null,null,null,null,0,null,"","","",""]
[null,null,null,null,null,null,null,null,0,null,"","","",""]
[null,null,null,null,null,null,null,null,0,null,"","","",""]
[null,null,null,null,null,null,null,null,0,null,"","","",""]
[null,null,null,null,null,null,null,null,0,null,"","","",""]
[null,null,null,null,null,null,null,null,0,null,"","","",""]
[null,null,null,null,null,null,null,null,0,null,"","","",""]
[null,null,null,null,null,null,null,null,0,null,"","","",""]
[null,null,null,null,null,null,null,null,0,null,"","","",""]
[null,null,null,null,null,null,null,null,0,null,"","","",""]
[null,null,null,null,null,null,null,null,0,null,"","","",""]
[null,null,null,null,null,null,null,null,0,null,"","","",""]
[null,null,null,null,null,null,null,null,0,null,"","","",""]
[null,null,null,null,null,null,null,null,0,null,"","","",""]
[null,null,null,null,null,null,null,null,0,null,"","","",""]
[null,null,null,null,null,null,null,null,0,null,"","","",""]
[null,null,null,null,null,null,null,null,0,null,"","","",""]
[null,null,null,null,null,null,null,null,0,null,"","","",""]
[null,null,null,null,null,null,null,null,0,null,"","","",""]
[null,null,null,null,null,null,null,null,0,null,"","","",""]
[null,null,null,null,null,null,null,null,0,null,"","","",""]
[null,null,null,null,null,null,null,null,0,null,"","","",""]
[null,null,null,null,null,null,null,null,0,null,"","","",""]
[null,null,null,null,null,null,null,null,0,null,"","","",""]
[null,null,null,null,null,null,null,null,0,null,"","","",""]
[null,null,null,null,null,null,null,null,0,null,"","","",""]
[null,null,null,null,null,null,null,null,0,null,"","","",""]
[null,null,null,null,null,null,null,null,0,null,"","","",""]
[null,null,null,null,null,null,null,null,{"$f":"IFERROR(G3943+H3943,\"\")","v":0},null,{"$f":"IFERROR(IF(J3943<>\"\",F3943*J3943,\"\"),\"\")","v":""},{"$f":"IFERROR(IF(J3943<>\"\",G3943*J3943,\"\"),\"\")","v":""},{"$f":"IFERROR(IF(J3943<>\"\",H3943*J3943,\"\"),\"\")","v":""},{"$f":"IFERROR(L3943+M3943,\"\")","v":""}]
[null,null,null,null,null,null,null,null,0,null,"","","",""]
[null,null,null,null,null,null,null,null,0,null,"","","",""]
[null,null,null,null,null,null,null,null,0,null,"","","",""]
[null,null,null,null,null,null,null,null,0,null,"","","",""]
[null,null,null,null,null,null,null,null,0,null,"","","",""]
[null,null,null,null,null,null,null,null,0,null,"","","",""]
[null,null,null,null,null,null,null,null,0,null,"","","",""]
[null,null,null,null,null,null,null,null,0,null,"","","",""]
[null,null,null,null,null,null,null,null,0,null,"","","",""]
[null,null,null,null,null,null,null,null,0,null,"","","",""]
[null,null,null,null,null,null,null,null,0,null,"","","",""]
[null,null,null,null,null,null,null,null,0,null,"","","",""]
[null,null,null,null,null,null,null,null,0,null,"","","",""]
[null,null,null,null,null,null,null,null,0,null,"","","",""]
[null,null,null,null,null,null,null,null,0,null,"","","",""]
[null,null,null,null,null,null,null,null,0,null,"","","",""]
[null,null,null,null,null,null,null,null,0,null,"","","",""]
[null,null,null,null,null,null,null,null,0,null,"","","",""]
[null,null,null,null,null,null,null,null,0,null,"","","",""]
[null,null,null,null,null,null,null,null,0,null,"","","",""]
[null,null,null,null,null,null,null,null,0,null,"","","",""]
[null,null,null,null,null,null,null,null,0,null,"","","",""]
[null,null,null,null,null,null,null,null,0,null,"","","",""]
[null,null,null,null,null,null,null,null,0,null,"","","",""]
[null,null,null,null,null,null,null,null,0,null,"","","",""]
[null,null,null,null,null,null,null,null,0,null,"","","",""]
[null,null,null,null,null,null,null,null,0,null,"","","",""]
[null,null,null,null,null,null,null,null,0,null,"","","",""]
[null,null,null,null,null,null,null,null,0,null,"","","",""]
[null,null,null,null,null,null,null,null,0,null,"","","",""]
[null,null,null,null,null,null,null,null,0,null,"","","",""]
[null,null,null,null,null,null,null,null,0,null,"","","",""]
[null,null,null,null,null,null,null,null,0,null,"","","",""]
[null,null,null,null,null,null,null,null,0,null,"","","",""]
[null,null,null,null,null,null,null,null,0,null,"","","",""]
[null,null,null,null,null,null,null,null,0,null,"","","",""]
[null,null,null,null,null,null,null,null,0,null,"","","",""]
[null,null,null,null,null,null,null,null,0,null,"","","",""]
[null,null,null,null,null,null,null,null,0,null,"","","",""]
[null,null,null,null,null,null,null,null,0,null,"","","",""]
[null,null,null,null,null,null,null,null,0,null,"","","",""]
[null,null,null,null,null,null,null,null,0,null,"","","",""]
[null,null,null,null,null,null,null,null,0,null,"","","",""]
[null,null,null,null,null,null,null,null,0,null,"","","",""]
[null,null,null,null,null,null,null,null,0,null,"","","",""]
[null,null,null,null,null,null,null,null,0,null,"","","",""]
[null,null,null,null,null,null,null,null,0,null,"","","",""]
[null,null,null,null,null,null,null,null,0,null,"","","",""]
[null,null,null,null,null,null,null,null,0,null,"","","",""]
[null,null,null,null,null,null,null,null,0,null,"","","",""]
[null,null,null,null,null,null,null,null,0,null,"","","",""]
[null,null,null,null,null,null,null,null,0,null,"","","",""]
[null,null,null,null,null,null,null,null,0,null,"","","",""]
[null,null,null,null,null,null,null,null,0,null,"","","",""]
[null,null,null,null,null,null,null,null,0,null,"","","",""]
[null,null,null,null,null,null,null,null,0,null,"","","",""]
[null,null,null,null,null,null,null,null,0,null,"","","",""]

{"sheet":"4.VS-B","index":6,"n_rows":4000,"n_cols":15,"rows_kept":4000,"cut":false,"hidden":false,"merged":[[5,5,5,8],[5,9,7,9],[5,10,5,13],[6,5,7,5],[6,6,6,8],[6,10,7,10],[6,11,6,13],[5,4,7,4],[0,1,1,1],[5,0,7,0],[5,1,7,1],[5,2,7,2],[5,3,7,3]]}
[null,{"$f":"CONCATENATE(\"OVERZICHT VORDERINGSSTAAT \",'1.Overzicht vorderingsstaat'!AR3,\" - DEEL B\")","v":"OVERZICHT VORDERINGSSTAAT 0 - DEEL B"},null,null,null,null,null,null,null,null,null,null,"Datum : ",{"$f":"'1.Overzicht vorderingsstaat'!AR8","v":"00:00:00"}]
[null,null,null,null,null,null,null,null,null,null,null,null,"Projectingenieur : ",{"$f":"'0.basisgegevens'!B6","v":0}]
["TE",{"$f":"'0.basisgegevens'!B2","v":0}]
["Titel",{"$f":"'0.basisgegevens'!B3","v":0}]
[null,null,null,null,null,null,null,null,null,"TOTAAL excl. BTW",{"$f":"IFERROR(IF(SUM(K9:K4000)<>0,SUM(K9:K4000),\"\"),\"\")","v":""},{"$f":"IFERROR(IF(SUM(L9:L4000)<>0,SUM(L9:L4000),\"\"),\"\")","v":""},{"$f":"IFERROR(IF(SUM(M9:M4000)<>0,SUM(M9:M4000),\"\"),\"\")","v":""},{"$f":"IFERROR(IF(SUM(N9:N4000)<>0,SUM(N9:N4000),\"\"),\"\")","v":""}]
["Artnr","Omschrijving","Herziening","Meting","EH","HOEVEELHEDEN",null,null,null,"Eenh.prijs \n(excl. BTW)","BEDRAGEN"]
[null,null,null,null,null,"Voorziene hoeveelheid","Uitgevoerde hoeveelheden",null,null,null,"Voorzien bedrag","Uitgevoerde bedragen"]
[null,null,null,null,null,null,"Vorige periode","Huidige periode","Cumul",null,null,"Vorige periode","Huidige periode","Cumul","afdrukbereik filter"]
[null,null,null,null,null,null,null,null,{"$f":"IFERROR(G9+H9,\"\")","v":0},null,{"$f":"IFERROR(IF(J9<>\"\",F9*J9,\"\"),\"\")","v":""},{"$f":"IFERROR(IF(J9<>\"\",G9*J9,\"\"),\"\")","v":""},{"$f":"IFERROR(IF(J9<>\"\",H9*J9,\"\"),\"\")","v":""},{"$f":"IFERROR(L9+M9,\"\")","v":""}]
[null,null,null,null,null,null,null,null,{"$f":"IFERROR(G10+H10,\"\")","v":0},null,{"$f":"IFERROR(IF(J10<>\"\",F10*J10,\"\"),\"\")","v":""},{"$f":"IFERROR(IF(J10<>\"\",G10*J10,\"\"),\"\")","v":""},{"$f":"IFERROR(IF(J10<>\"\",H10*J10,\"\"),\"\")","v":""},{"$f":"IFERROR(L10+M10,\"\")","v":""}]
[null,null,null,null,null,null,null,null,0,null,"","","",""]
[null,null,null,null,null,null,null,null,0,null,"","","",""]
[null,null,null,null,null,null,null,null,0,null,"","","",""]
[null,null,null,null,null,null,null,null,0,null,"","","",""]
[null,null,null,null,null,null,null,null,0,null,"","","",""]
[null,null,null,null,null,null,null,null,0,null,"","","",""]
[null,null,null,null,null,null,null,null,0,null,"","","",""]
[null,null,null,null,null,null,null,null,0,null,"","","",""]
[null,null,null,null,null,null,null,null,0,null,"","","",""]
[null,null,null,null,null,null,null,null,0,null,"","","",""]
[null,null,null,null,null,null,null,null,0,null,"","","",""]
[null,null,null,null,null,null,null,null,0,null,"","","",""]
[null,null,null,null,null,null,null,null,0,null,"","","",""]
[null,null,null,null,null,null,null,null,0,null,"","","",""]
[null,null,null,null,null,null,null,null,0,null,"","","",""]
[null,null,null,null,null,null,null,null,0,null,"","","",""]
[null,null,null,null,null,null,null,null,0,null,"","","",""]
[null,null,null,null,null,null,null,null,0,null,"","","",""]
[null,null,null,null,null,null,null,null,0,null,"","","",""]
[null,null,null,null,null,null,null,null,0,null,"","","",""]
[null,null,null,null,null,null,null,null,0,null,"","","",""]
[null,null,null,null,null,null,null,null,0,null,"","","",""]
[null,null,null,null,null,null,null,null,0,null,"","","",""]
[null,null,null,null,null,null,null,null,0,null,"","","",""]
[null,null,null,null,null,null,null,null,0,null,"","","",""]
[null,null,null,null,null,null,null,null,0,null,"","","",""]
[null,null,null,null,null,null,null,null,0,null,"","","",""]
[null,null,null,null,null,null,null,null,0,null,"","","",""]
[null,null,null,null,null,null,null,null,0,null,"","","",""]
[null,null,null,null,null,null,null,null,0,null,"","","",""]
[null,null,null,null,null,null,null,null,0,null,"","","",""]
[null,null,null,null,null,null,null,null,0,null,"","","",""]
[null,null,null,null,null,null,null,null,0,null,"","","",""]
[null,null,null,null,null,null,null,null,0,null,"","","",""]
[null,null,null,null,null,null,null,null,0,null,"","","",""]
[null,null,null,null,null,null,null,null,0,null,"","","",""]
[null,null,null,null,null,null,null,null,0,null,"","","",""]
[null,null,null,null,null,null,null,null,0,null,"","","",""]
[null,null,null,null,null,null,null,null,0,null,"","","",""]
[null,null,null,null,null,null,null,null,0,null,"","","",""]
[null,null,null,null,null,null,null,null,0,null,"","","",""]
[null,null,null,null,null,null,null,null,0,null,"","","",""]
[null,null,null,null,null,null,null,null,0,null,"","","",""]
[null,null,null,null,null,null,null,null,0,null,"","","",""]
[null,null,null,null,null,null,null,null,0,null,"","","",""]
[null,null,null,null,null,null,null,null,0,null,"","","",""]
[null,null,null,null,null,null,null,null,0,null,"","","",""]
[null,null,null,null,null,null,null,null,0,null,"","","",""]
[null,null,null,null,null,null,null,null,0,null,"","","",""]
[null,null,null,null,null,null,null,null,0,null,"","","",""]
[null,null,null,null,null,null,null,null,0,null,"","","",""]
[null,null,null,null,null,null,null,null,0,null,"","","",""]
[null,null,null,null,null,null,null,null,0,null,"","","",""]
[null,null,null,null,null,null,null,null,0,null,"","","",""]
[null,null,null,null,null,null,null,null,0,null,"","","",""]
[null,null,null,null,null,null,null,null,0,null,"","","",""]
[null,null,null,null,null,null,null,null,0,null,"","","",""]
[null,null,null,null,null,null,null,null,0,null,"","","",""]
[null,null,null,null,null,null,null,null,0,null,"","","",""]
[null,null,null,null,null,null,null,null,0,null,"","","",""]
[null,null,null,null,null,null,null,null,0,null,"","","",""]
[null,null,null,null,null,null,null,null,0,null,"","","",""]
[null,null,null,null,null,null,null,null,0,null,"","","",""]
[null,null,null,null,null,null,null,null,{"$f":"IFERROR(G74+H74,\"\")","v":0},null,{"$f":"IFERROR(IF(J74<>\"\",F74*J74,\"\"),\"\")","v":""},{"$f":"IFERROR(IF(J74<>\"\",G74*J74,\"\"),\"\")","v":""},{"$f":"IFERROR(IF(J74<>\"\",H74*J74,\"\"),\"\")","v":""},{"$f":"IFERROR(L74+M74,\"\")","v":""}]
[null,null,null,null,null,null,null,null,0,null,"","","",""]
[null,null,null,null,null,null,null,null,0,null,"","","",""]
[null,null,null,null,null,null,null,null,0,null,"","","",""]
[null,null,null,null,null,null,null,null,0,null,"","","",""]
[null,null,null,null,null,null,null,null,0,null,"","","",""]
[null,null,null,null,null,null,null,null,0,null,"","","",""]
[null,null,null,null,null,null,null,null,0,null,"","","",""]
[null,null,null,null,null,null,null,null,0,null,"","","",""]
[null,null,null,null,null,null,null,null,0,null,"","","",""]
[null,null,null,null,null,null,null,null,0,null,"","","",""]
[null,null,null,null,null,null,null,null,0,null,"","","",""]
[null,null,null,null,null,null,null,null,0,null,"","","",""]
[null,null,null,null,null,null,null,null,0,null,"","","",""]
[null,null,null,null,null,null,null,null,0,null,"","","",""]
[null,null,null,null,null,null,null,null,0,null,"","","",""]
[null,null,null,null,null,null,null,null,0,null,"","","",""]
[null,null,null,null,null,null,null,null,0,null,"","","",""]
[null,null,null,null,null,null,null,null,0,null,"","","",""]
[null,null,null,null,null,null,null,null,0,null,"","","",""]
[null,null,null,null,null,null,null,null,0,null,"","","",""]
[null,null,null,null,null,null,null,null,0,null,"","","",""]
[null,null,null,null,null,null,null,null,0,null,"","","",""]
[null,null,null,null,null,null,null,null,0,null,"","","",""]
[null,null,null,null,null,null,null,null,0,null,"","","",""]
[null,null,null,null,null,null,null,null,0,null,"","","",""]
[null,null,null,null,null,null,null,null,0,null,"","","",""]
[null,null,null,null,null,null,null,null,0,null,"","","",""]
[null,null,null,null,null,null,null,null,0,null,"","","",""]
[null,null,null,null,null,null,null,null,0,null,"","","",""]
[null,null,null,null,null,null,null,null,0,null,"","","",""]
[null,null,null,null,null,null,null,null,0,null,"","","",""]
[null,null,null,null,null,null,null,null,0,null,"","","",""]
[null,null,null,null,null,null,null,null,0,null,"","","",""]
[null,null,null,null,null,null,null,null,0,null,"","","",""]
[null,null,null,null,null,null,null,null,0,null,"","","",""]
[null,null,null,null,null,null,null,null,0,null,"","","",""]
[null,null,null,null,null,null,null,null,0,null,"","","",""]
[null,null,null,null,null,null,null,null,0,null,"","","",""]
[null,null,null,null,null,null,null,null,0,null,"","","",""]
[null,null,null,null,null,null,null,null,0,null,"","","",""]
[null,null,null,null,null,null,null,null,0,null,"","","",""]
[null,null,null,null,null,null,null,null,0,null,"","","",""]
[null,null,null,null,null,null,null,null,0,null,"","","",""]
[null,null,null,null,null,null,null,null,0,null,"","","",""]
[null,null,null,null,null,null,null,null,0,null,"","","",""]
[null,null,null,null,null,null,null,null,0,null,"","","",""]
[null,null,null,null,null,null,null,null,0,null,"","","",""]
[null,null,null,null,null,null,null,null,0,null,"","","",""]
[null,null,null,null,null,null,null,null,0,null,"","","",""]
[null,null,null,null,null,null,null,null,0,null,"","","",""]
[null,null,null,null,null,null,null,null,0,null,"","","",""]
[null,null,null,null,null,null,null,null,0,null,"","","",""]
[null,null,null,null,null,null,null,null,0,null,"","","",""]
[null,null,null,null,null,null,null,null,0,null,"","","",""]
[null,null,null,null,null,null,null,null,0,null,"","","",""]
[null,null,null,null,null,null,null,null,0,null,"","","",""]
[null,null,null,null,null,null,null,null,0,null,"","","",""]
[null,null,null,null,null,null,null,null,0,null,"","","",""]
[null,null,null,null,null,null,null,null,0,null,"","","",""]
[null,null,null,null,null,null,null,null,0,null,"","","",""]
[null,null,null,null,null,null,null,null,0,null,"","","",""]
[null,null,null,null,null,null,null,null,0,null,"","","",""]
[null,null,null,null,null,null,null,null,0,null,"","","",""]
[null,null,null,null,null,null,null,null,{"$f":"IFERROR(G138+H138,\"\")","v":0},null,{"$f":"IFERROR(IF(J138<>\"\",F138*J138,\"\"),\"\")","v":""},{"$f":"IFERROR(IF(J138<>\"\",G138*J138,\"\"),\"\")","v":""},{"$f":"IFERROR(IF(J138<>\"\",H138*J138,\"\"),\"\")","v":""},{"$f":"IFERROR(L138+M138,\"\")","v":""}]
[null,null,null,null,null,null,null,null,0,null,"","","",""]
[null,null,null,null,null,null,null,null,0,null,"","","",""]
[null,null,null,null,null,null,null,null,0,null,"","","",""]
[null,null,null,null,null,null,null,null,0,null,"","","",""]
[null,null,null,null,null,null,null,null,0,null,"","","",""]
[null,null,null,null,null,null,null,null,0,null,"","","",""]
[null,null,null,null,null,null,null,null,0,null,"","","",""]
[null,null,null,null,null,null,null,null,0,null,"","","",""]
[null,null,null,null,null,null,null,null,0,null,"","","",""]
[null,null,null,null,null,null,null,null,0,null,"","","",""]
[null,null,null,null,null,null,null,null,0,null,"","","",""]
[null,null,null,null,null,null,null,null,0,null,"","","",""]
[null,null,null,null,null,null,null,null,0,null,"","","",""]
[null,null,null,null,null,null,null,null,0,null,"","","",""]
[null,null,null,null,null,null,null,null,0,null,"","","",""]
[null,null,null,null,null,null,null,null,0,null,"","","",""]
[null,null,null,null,null,null,null,null,0,null,"","","",""]
[null,null,null,null,null,null,null,null,0,null,"","","",""]
[null,null,null,null,null,null,null,null,0,null,"","","",""]
[null,null,null,null,null,null,null,null,0,null,"","","",""]
[null,null,null,null,null,null,null,null,0,null,"","","",""]
[null,null,null,null,null,null,null,null,0,null,"","","",""]
[null,null,null,null,null,null,null,null,0,null,"","","",""]
[null,null,null,null,null,null,null,null,0,null,"","","",""]
[null,null,null,null,null,null,null,null,0,null,"","","",""]
[null,null,null,null,null,null,null,null,0,null,"","","",""]
[null,null,null,null,null,null,null,null,0,null,"","","",""]
[null,null,null,null,null,null,null,null,0,null,"","","",""]
[null,null,null,null,null,null,null,null,0,null,"","","",""]
[null,null,null,null,null,null,null,null,0,null,"","","",""]
[null,null,null,null,null,null,null,null,0,null,"","","",""]
[null,null,null,null,null,null,null,null,0,null,"","","",""]
[null,null,null,null,null,null,null,null,0,null,"","","",""]
[null,null,null,null,null,null,null,null,0,null,"","","",""]
[null,null,null,null,null,null,null,null,0,null,"","","",""]
[null,null,null,null,null,null,null,null,0,null,"","","",""]
[null,null,null,null,null,null,null,null,0,null,"","","",""]
[null,null,null,null,null,null,null,null,0,null,"","","",""]
[null,null,null,null,null,null,null,null,0,null,"","","",""]
[null,null,null,null,null,null,null,null,0,null,"","","",""]
[null,null,null,null,null,null,null,null,0,null,"","","",""]
[null,null,null,null,null,null,null,null,0,null,"","","",""]
[null,null,null,null,null,null,null,null,0,null,"","","",""]
[null,null,null,null,null,null,null,null,0,null,"","","",""]
[null,null,null,null,null,null,null,null,0,null,"","","",""]
[null,null,null,null,null,null,null,null,0,null,"","","",""]
[null,null,null,null,null,null,null,null,0,null,"","","",""]
[null,null,null,null,null,null,null,null,0,null,"","","",""]
[null,null,null,null,null,null,null,null,0,null,"","","",""]
[null,null,null,null,null,null,null,null,0,null,"","","",""]
[null,null,null,null,null,null,null,null,0,null,"","","",""]
[null,null,null,null,null,null,null,null,0,null,"","","",""]
[null,null,null,null,null,null,null,null,0,null,"","","",""]
[null,null,null,null,null,null,null,null,0,null,"","","",""]
[null,null,null,null,null,null,null,null,0,null,"","","",""]
[null,null,null,null,null,null,null,null,0,null,"","","",""]
[null,null,null,null,null,null,null,null,0,null,"","","",""]
[null,null,null,null,null,null,null,null,0,null,"","","",""]
[null,null,null,null,null,null,null,null,0,null,"","","",""]
[null,null,null,null,null,null,null,null,0,null,"","","",""]
[null,null,null,null,null,null,null,null,0,null,"","","",""]
[null,null,null,null,null,null,null,null,0,null,"","","",""]
[null,null,null,null,null,null,null,null,0,null,"","","",""]
[null,null,null,null,null,null,null,null,{"$f":"IFERROR(G202+H202,\"\")","v":0},null,{"$f":"IFERROR(IF(J202<>\"\",F202*J202,\"\"),\"\")","v":""},{"$f":"IFERROR(IF(J202<>\"\",G202*J202,\"\"),\"\")","v":""},{"$f":"IFERROR(IF(J202<>\"\",H202*J202,\"\"),\"\")","v":""},{"$f":"IFERROR(L202+M202,\"\")","v":""}]
[null,null,null,null,null,null,null,null,0,null,"","","",""]
[null,null,null,null,null,null,null,null,0,null,"","","",""]
[null,null,null,null,null,null,null,null,0,null,"","","",""]
[null,null,null,null,null,null,null,null,0,null,"","","",""]
[null,null,null,null,null,null,null,null,0,null,"","","",""]
[null,null,null,null,null,null,null,null,0,null,"","","",""]
[null,null,null,null,null,null,null,null,0,null,"","","",""]
[null,null,null,null,null,null,null,null,0,null,"","","",""]
[null,null,null,null,null,null,null,null,0,null,"","","",""]
[null,null,null,null,null,null,null,null,0,null,"","","",""]
[null,null,null,null,null,null,null,null,0,null,"","","",""]
[null,null,null,null,null,null,null,null,0,null,"","","",""]
[null,null,null,null,null,null,null,null,0,null,"","","",""]
[null,null,null,null,null,null,null,null,0,null,"","","",""]
[null,null,null,null,null,null,null,null,0,null,"","","",""]
[null,null,null,null,null,null,null,null,0,null,"","","",""]
[null,null,null,null,null,null,null,null,0,null,"","","",""]
[null,null,null,null,null,null,null,null,0,null,"","","",""]
[null,null,null,null,null,null,null,null,0,null,"","","",""]
[null,null,null,null,null,null,null,null,0,null,"","","",""]
[null,null,null,null,null,null,null,null,0,null,"","","",""]
[null,null,null,null,null,null,null,null,0,null,"","","",""]
[null,null,null,null,null,null,null,null,0,null,"","","",""]
[null,null,null,null,null,null,null,null,0,null,"","","",""]
[null,null,null,null,null,null,null,null,0,null,"","","",""]
[null,null,null,null,null,null,null,null,0,null,"","","",""]
[null,null,null,null,null,null,null,null,0,null,"","","",""]
[null,null,null,null,null,null,null,null,0,null,"","","",""]
[null,null,null,null,null,null,null,null,0,null,"","","",""]
[null,null,null,null,null,null,null,null,0,null,"","","",""]
[null,null,null,null,null,null,null,null,0,null,"","","",""]
[null,null,null,null,null,null,null,null,0,null,"","","",""]
[null,null,null,null,null,null,null,null,0,null,"","","",""]
[null,null,null,null,null,null,null,null,0,null,"","","",""]
[null,null,null,null,null,null,null,null,0,null,"","","",""]
[null,null,null,null,null,null,null,null,0,null,"","","",""]
[null,null,null,null,null,null,null,null,0,null,"","","",""]
[null,null,null,null,null,null,null,null,0,null,"","","",""]
[null,null,null,null,null,null,null,null,0,null,"","","",""]
[null,null,null,null,null,null,null,null,0,null,"","","",""]
[null,null,null,null,null,null,null,null,0,null,"","","",""]
[null,null,null,null,null,null,null,null,0,null,"","","",""]
[null,null,null,null,null,null,null,null,0,null,"","","",""]
[null,null,null,null,null,null,null,null,0,null,"","","",""]
[null,null,null,null,null,null,null,null,0,null,"","","",""]
[null,null,null,null,null,null,null,null,0,null,"","","",""]
[null,null,null,null,null,null,null,null,0,null,"","","",""]
[null,null,null,null,null,null,null,null,0,null,"","","",""]
[null,null,null,null,null,null,null,null,0,null,"","","",""]
[null,null,null,null,null,null,null,null,0,null,"","","",""]
[null,null,null,null,null,null,null,null,0,null,"","","",""]
[null,null,null,null,null,null,null,null,0,null,"","","",""]
[null,null,null,null,null,null,null,null,0,null,"","","",""]
[null,null,null,null,null,null,null,null,0,null,"","","",""]
[null,null,null,null,null,null,null,null,0,null,"","","",""]
[null,null,null,null,null,null,null,null,0,null,"","","",""]
[null,null,null,null,null,null,null,null,0,null,"","","",""]
[null,null,null,null,null,null,null,null,0,null,"","","",""]
[null,null,null,null,null,null,null,null,0,null,"","","",""]
[null,null,null,null,null,null,null,null,0,null,"","","",""]
[null,null,null,null,null,null,null,null,0,null,"","","",""]
[null,null,null,null,null,null,null,null,0,null,"","","",""]
[null,null,null,null,null,null,null,null,0,null,"","","",""]
[null,null,null,null,null,null,null,null,{"$f":"IFERROR(G266+H266,\"\")","v":0},null,{"$f":"IFERROR(IF(J266<>\"\",F266*J266,\"\"),\"\")","v":""},{"$f":"IFERROR(IF(J266<>\"\",G266*J266,\"\"),\"\")","v":""},{"$f":"IFERROR(IF(J266<>\"\",H266*J266,\"\"),\"\")","v":""},{"$f":"IFERROR(L266+M266,\"\")","v":""}]
[null,null,null,null,null,null,null,null,0,null,"","","",""]
[null,null,null,null,null,null,null,null,0,null,"","","",""]
[null,null,null,null,null,null,null,null,0,null,"","","",""]
[null,null,null,null,null,null,null,null,0,null,"","","",""]
[null,null,null,null,null,null,null,null,0,null,"","","",""]
[null,null,null,null,null,null,null,null,0,null,"","","",""]
[null,null,null,null,null,null,null,null,0,null,"","","",""]
[null,null,null,null,null,null,null,null,0,null,"","","",""]
[null,null,null,null,null,null,null,null,0,null,"","","",""]
[null,null,null,null,null,null,null,null,0,null,"","","",""]
[null,null,null,null,null,null,null,null,0,null,"","","",""]
[null,null,null,null,null,null,null,null,0,null,"","","",""]
[null,null,null,null,null,null,null,null,0,null,"","","",""]
[null,null,null,null,null,null,null,null,0,null,"","","",""]
[null,null,null,null,null,null,null,null,0,null,"","","",""]
[null,null,null,null,null,null,null,null,0,null,"","","",""]
[null,null,null,null,null,null,null,null,0,null,"","","",""]
[null,null,null,null,null,null,null,null,0,null,"","","",""]
[null,null,null,null,null,null,null,null,0,null,"","","",""]
[null,null,null,null,null,null,null,null,0,null,"","","",""]
[null,null,null,null,null,null,null,null,0,null,"","","",""]
[null,null,null,null,null,null,null,null,0,null,"","","",""]
[null,null,null,null,null,null,null,null,0,null,"","","",""]
[null,null,null,null,null,null,null,null,0,null,"","","",""]
[null,null,null,null,null,null,null,null,0,null,"","","",""]
[null,null,null,null,null,null,null,null,0,null,"","","",""]
[null,null,null,null,null,null,null,null,0,null,"","","",""]
[null,null,null,null,null,null,null,null,0,null,"","","",""]
[null,null,null,null,null,null,null,null,0,null,"","","",""]
[null,null,null,null,null,null,null,null,0,null,"","","",""]
[null,null,null,null,null,null,null,null,0,null,"","","",""]
[null,null,null,null,null,null,null,null,0,null,"","","",""]
[null,null,null,null,null,null,null,null,0,null,"","","",""]
[null,null,null,null,null,null,null,null,0,null,"","","",""]
[null,null,null,null,null,null,null,null,0,null,"","","",""]
[null,null,null,null,null,null,null,null,0,null,"","","",""]
[null,null,null,null,null,null,null,null,0,null,"","","",""]
[null,null,null,null,null,null,null,null,0,null,"","","",""]
[null,null,null,null,null,null,null,null,0,null,"","","",""]
[null,null,null,null,null,null,null,null,0,null,"","","",""]
[null,null,null,null,null,null,null,null,0,null,"","","",""]
[null,null,null,null,null,null,null,null,0,null,"","","",""]
[null,null,null,null,null,null,null,null,0,null,"","","",""]
[null,null,null,null,null,null,null,null,0,null,"","","",""]
[null,null,null,null,null,null,null,null,0,null,"","","",""]
[null,null,null,null,null,null,null,null,0,null,"","","",""]
[null,null,null,null,null,null,null,null,0,null,"","","",""]
[null,null,null,null,null,null,null,null,0,null,"","","",""]
[null,null,null,null,null,null,null,null,0,null,"","","",""]
[null,null,null,null,null,null,null,null,0,null,"","","",""]
[null,null,null,null,null,null,null,null,0,null,"","","",""]
[null,null,null,null,null,null,null,null,0,null,"","","",""]
[null,null,null,null,null,null,null,null,0,null,"","","",""]
[null,null,null,null,null,null,null,null,0,null,"","","",""]
[null,null,null,null,null,null,null,null,0,null,"","","",""]
[null,null,null,null,null,null,null,null,0,null,"","","",""]
[null,null,null,null,null,null,null,null,0,null,"","","",""]
[null,null,null,null,null,null,null,null,0,null,"","","",""]
[null,null,null,null,null,null,null,null,0,null,"","","",""]
[null,null,null,null,null,null,null,null,0,null,"","","",""]
[null,null,null,null,null,null,null,null,0,null,"","","",""]
[null,null,null,null,null,null,null,null,0,null,"","","",""]
[null,null,null,null,null,null,null,null,0,null,"","","",""]
[null,null,null,null,null,null,null,null,{"$f":"IFERROR(G330+H330,\"\")","v":0},null,{"$f":"IFERROR(IF(J330<>\"\",F330*J330,\"\"),\"\")","v":""},{"$f":"IFERROR(IF(J330<>\"\",G330*J330,\"\"),\"\")","v":""},{"$f":"IFERROR(IF(J330<>\"\",H330*J330,\"\"),\"\")","v":""},{"$f":"IFERROR(L330+M330,\"\")","v":""}]
[null,null,null,null,null,null,null,null,0,null,"","","",""]
[null,null,null,null,null,null,null,null,0,null,"","","",""]
[null,null,null,null,null,null,null,null,0,null,"","","",""]
[null,null,null,null,null,null,null,null,0,null,"","","",""]
[null,null,null,null,null,null,null,null,0,null,"","","",""]
[null,null,null,null,null,null,null,null,0,null,"","","",""]
[null,null,null,null,null,null,null,null,0,null,"","","",""]
[null,null,null,null,null,null,null,null,0,null,"","","",""]
[null,null,null,null,null,null,null,null,0,null,"","","",""]
[null,null,null,null,null,null,null,null,0,null,"","","",""]
[null,null,null,null,null,null,null,null,0,null,"","","",""]
[null,null,null,null,null,null,null,null,0,null,"","","",""]
[null,null,null,null,null,null,null,null,0,null,"","","",""]
[null,null,null,null,null,null,null,null,0,null,"","","",""]
[null,null,null,null,null,null,null,null,0,null,"","","",""]
[null,null,null,null,null,null,null,null,0,null,"","","",""]
[null,null,null,null,null,null,null,null,0,null,"","","",""]
[null,null,null,null,null,null,null,null,0,null,"","","",""]
[null,null,null,null,null,null,null,null,0,null,"","","",""]
[null,null,null,null,null,null,null,null,0,null,"","","",""]
[null,null,null,null,null,null,null,null,0,null,"","","",""]
[null,null,null,null,null,null,null,null,0,null,"","","",""]
[null,null,null,null,null,null,null,null,0,null,"","","",""]
[null,null,null,null,null,null,null,null,0,null,"","","",""]
[null,null,null,null,null,null,null,null,0,null,"","","",""]
[null,null,null,null,null,null,null,null,0,null,"","","",""]
[null,null,null,null,null,null,null,null,0,null,"","","",""]
[null,null,null,null,null,null,null,null,0,null,"","","",""]
[null,null,null,null,null,null,null,null,0,null,"","","",""]
[null,null,null,null,null,null,null,null,0,null,"","","",""]
[null,null,null,null,null,null,null,null,0,null,"","","",""]
[null,null,null,null,null,null,null,null,0,null,"","","",""]
[null,null,null,null,null,null,null,null,0,null,"","","",""]
[null,null,null,null,null,null,null,null,0,null,"","","",""]
[null,null,null,null,null,null,null,null,0,null,"","","",""]
[null,null,null,null,null,null,null,null,0,null,"","","",""]
[null,null,null,null,null,null,null,null,0,null,"","","",""]
[null,null,null,null,null,null,null,null,0,null,"","","",""]
[null,null,null,null,null,null,null,null,0,null,"","","",""]
[null,null,null,null,null,null,null,null,0,null,"","","",""]
[null,null,null,null,null,null,null,null,0,null,"","","",""]
[null,null,null,null,null,null,null,null,0,null,"","","",""]
[null,null,null,null,null,null,null,null,0,null,"","","",""]
[null,null,null,null,null,null,null,null,0,null,"","","",""]
[null,null,null,null,null,null,null,null,0,null,"","","",""]
[null,null,null,null,null,null,null,null,0,null,"","","",""]
[null,null,null,null,null,null,null,null,0,null,"","","",""]
[null,null,null,null,null,null,null,null,0,null,"","","",""]
[null,null,null,null,null,null,null,null,0,null,"","","",""]
[null,null,null,null,null,null,null,null,0,null,"","","",""]
[null,null,null,null,null,null,null,null,0,null,"","","",""]
[null,null,null,null,null,null,null,null,0,null,"","","",""]
[null,null,null,null,null,null,null,null,0,null,"","","",""]
[null,null,null,null,null,null,null,null,0,null,"","","",""]
[null,null,null,null,null,null,null,null,0,null,"","","",""]
[null,null,null,null,null,null,null,null,0,null,"","","",""]
[null,null,null,null,null,null,null,null,0,null,"","","",""]
[null,null,null,null,null,null,null,null,0,null,"","","",""]
[null,null,null,null,null,null,null,null,0,null,"","","",""]
[null,null,null,null,null,null,null,null,0,null,"","","",""]
[null,null,null,null,null,null,null,null,0,null,"","","",""]
[null,null,null,null,null,null,null,null,0,null,"","","",""]
[null,null,null,null,null,null,null,null,0,null,"","","",""]
[null,null,null,null,null,null,null,null,{"$f":"IFERROR(G394+H394,\"\")","v":0},null,{"$f":"IFERROR(IF(J394<>\"\",F394*J394,\"\"),\"\")","v":""},{"$f":"IFERROR(IF(J394<>\"\",G394*J394,\"\"),\"\")","v":""},{"$f":"IFERROR(IF(J394<>\"\",H394*J394,\"\"),\"\")","v":""},{"$f":"IFERROR(L394+M394,\"\")","v":""}]
[null,null,null,null,null,null,null,null,0,null,"","","",""]
[null,null,null,null,null,null,null,null,0,null,"","","",""]
[null,null,null,null,null,null,null,null,0,null,"","","",""]
[null,null,null,null,null,null,null,null,0,null,"","","",""]
[null,null,null,null,null,null,null,null,0,null,"","","",""]
[null,null,null,null,null,null,null,null,0,null,"","","",""]
[null,null,null,null,null,null,null,null,0,null,"","","",""]
[null,null,null,null,null,null,null,null,0,null,"","","",""]
[null,null,null,null,null,null,null,null,0,null,"","","",""]
[null,null,null,null,null,null,null,null,0,null,"","","",""]
[null,null,null,null,null,null,null,null,0,null,"","","",""]
[null,null,null,null,null,null,null,null,0,null,"","","",""]
[null,null,null,null,null,null,null,null,0,null,"","","",""]
[null,null,null,null,null,null,null,null,0,null,"","","",""]
[null,null,null,null,null,null,null,null,0,null,"","","",""]
[null,null,null,null,null,null,null,null,0,null,"","","",""]
[null,null,null,null,null,null,null,null,0,null,"","","",""]
[null,null,null,null,null,null,null,null,0,null,"","","",""]
[null,null,null,null,null,null,null,null,0,null,"","","",""]
[null,null,null,null,null,null,null,null,0,null,"","","",""]
[null,null,null,null,null,null,null,null,0,null,"","","",""]
[null,null,null,null,null,null,null,null,0,null,"","","",""]
[null,null,null,null,null,null,null,null,0,null,"","","",""]
[null,null,null,null,null,null,null,null,0,null,"","","",""]
[null,null,null,null,null,null,null,null,0,null,"","","",""]
[null,null,null,null,null,null,null,null,0,null,"","","",""]
[null,null,null,null,null,null,null,null,0,null,"","","",""]
[null,null,null,null,null,null,null,null,0,null,"","","",""]
[null,null,null,null,null,null,null,null,0,null,"","","",""]
[null,null,null,null,null,null,null,null,0,null,"","","",""]
[null,null,null,null,null,null,null,null,0,null,"","","",""]
[null,null,null,null,null,null,null,null,0,null,"","","",""]
[null,null,null,null,null,null,null,null,0,null,"","","",""]
[null,null,null,null,null,null,null,null,0,null,"","","",""]
[null,null,null,null,null,null,null,null,0,null,"","","",""]
[null,null,null,null,null,null,null,null,0,null,"","","",""]
[null,null,null,null,null,null,null,null,0,null,"","","",""]
[null,null,null,null,null,null,null,null,0,null,"","","",""]
[null,null,null,null,null,null,null,null,0,null,"","","",""]
[null,null,null,null,null,null,null,null,0,null,"","","",""]
[null,null,null,null,null,null,null,null,0,null,"","","",""]
[null,null,null,null,null,null,null,null,0,null,"","","",""]
[null,null,null,null,null,null,null,null,0,null,"","","",""]
[null,null,null,null,null,null,null,null,0,null,"","","",""]
[null,null,null,null,null,null,null,null,0,null,"","","",""]
[null,null,null,null,null,null,null,null,0,null,"","","",""]
[null,null,null,null,null,null,null,null,0,null,"","","",""]
[null,null,null,null,null,null,null,null,0,null,"","","",""]
[null,null,null,null,null,null,null,null,0,null,"","","",""]
[null,null,null,null,null,null,null,null,0,null,"","","",""]
[null,null,null,null,null,null,null,null,0,null,"","","",""]
[null,null,null,null,null,null,null,null,0,null,"","","",""]
[null,null,null,null,null,null,null,null,0,null,"","","",""]
[null,null,null,null,null,null,null,null,0,null,"","","",""]
[null,null,null,null,null,null,null,null,0,null,"","","",""]
[null,null,null,null,null,null,null,null,0,null,"","","",""]
[null,null,null,null,null,null,null,null,0,null,"","","",""]
[null,null,null,null,null,null,null,null,0,null,"","","",""]
[null,null,null,null,null,null,null,null,0,null,"","","",""]
[null,null,null,null,null,null,null,null,0,null,"","","",""]
[null,null,null,null,null,null,null,null,0,null,"","","",""]
[null,null,null,null,null,null,null,null,0,null,"","","",""]
[null,null,null,null,null,null,null,null,0,null,"","","",""]
[null,null,null,null,null,null,null,null,{"$f":"IFERROR(G458+H458,\"\")","v":0},null,{"$f":"IFERROR(IF(J458<>\"\",F458*J458,\"\"),\"\")","v":""},{"$f":"IFERROR(IF(J458<>\"\",G458*J458,\"\"),\"\")","v":""},{"$f":"IFERROR(IF(J458<>\"\",H458*J458,\"\"),\"\")","v":""},{"$f":"IFERROR(L458+M458,\"\")","v":""}]
[null,null,null,null,null,null,null,null,0,null,"","","",""]
[null,null,null,null,null,null,null,null,0,null,"","","",""]
[null,null,null,null,null,null,null,null,0,null,"","","",""]
[null,null,null,null,null,null,null,null,0,null,"","","",""]
[null,null,null,null,null,null,null,null,0,null,"","","",""]
[null,null,null,null,null,null,null,null,0,null,"","","",""]
[null,null,null,null,null,null,null,null,0,null,"","","",""]
[null,null,null,null,null,null,null,null,0,null,"","","",""]
[null,null,null,null,null,null,null,null,0,null,"","","",""]
[null,null,null,null,null,null,null,null,0,null,"","","",""]
[null,null,null,null,null,null,null,null,0,null,"","","",""]
[null,null,null,null,null,null,null,null,0,null,"","","",""]
[null,null,null,null,null,null,null,null,0,null,"","","",""]
[null,null,null,null,null,null,null,null,0,null,"","","",""]
[null,null,null,null,null,null,null,null,0,null,"","","",""]
[null,null,null,null,null,null,null,null,0,null,"","","",""]
[null,null,null,null,null,null,null,null,0,null,"","","",""]
[null,null,null,null,null,null,null,null,0,null,"","","",""]
[null,null,null,null,null,null,null,null,0,null,"","","",""]
[null,null,null,null,null,null,null,null,0,null,"","","",""]
[null,null,null,null,null,null,null,null,0,null,"","","",""]
[null,null,null,null,null,null,null,null,0,null,"","","",""]
[null,null,null,null,null,null,null,null,0,null,"","","",""]
[null,null,null,null,null,null,null,null,0,null,"","","",""]
[null,null,null,null,null,null,null,null,0,null,"","","",""]
[null,null,null,null,null,null,null,null,0,null,"","","",""]
[null,null,null,null,null,null,null,null,0,null,"","","",""]
[null,null,null,null,null,null,null,null,0,null,"","","",""]
[null,null,null,null,null,null,null,null,0,null,"","","",""]
[null,null,null,null,null,null,null,null,0,null,"","","",""]
[null,null,null,null,null,null,null,null,0,null,"","","",""]
[null,null,null,null,null,null,null,null,0,null,"","","",""]
[null,null,null,null,null,null,null,null,0,null,"","","",""]
[null,null,null,null,null,null,null,null,0,null,"","","",""]
[null,null,null,null,null,null,null,null,0,null,"","","",""]
[null,null,null,null,null,null,null,null,0,null,"","","",""]
[null,null,null,null,null,null,null,null,0,null,"","","",""]
[null,null,null,null,null,null,null,null,0,null,"","","",""]
[null,null,null,null,null,null,null,null,0,null,"","","",""]
[null,null,null,null,null,null,null,null,0,null,"","","",""]
[null,null,null,null,null,null,null,null,0,null,"","","",""]
[null,null,null,null,null,null,null,null,0,null,"","","",""]
[null,null,null,null,null,null,null,null,0,null,"","","",""]
[null,null,null,null,null,null,null,null,0,null,"","","",""]
[null,null,null,null,null,null,null,null,0,null,"","","",""]
[null,null,null,null,null,null,null,null,0,null,"","","",""]
[null,null,null,null,null,null,null,null,0,null,"","","",""]
[null,null,null,null,null,null,null,null,0,null,"","","",""]
[null,null,null,null,null,null,null,null,0,null,"","","",""]
[null,null,null,null,null,null,null,null,0,null,"","","",""]
[null,null,null,null,null,null,null,null,0,null,"","","",""]
[null,null,null,null,null,null,null,null,0,null,"","","",""]
[null,null,null,null,null,null,null,null,0,null,"","","",""]
[null,null,null,null,null,null,null,null,0,null,"","","",""]
[null,null,null,null,null,null,null,null,0,null,"","","",""]
[null,null,null,null,null,null,null,null,0,null,"","","",""]
[null,null,null,null,null,null,null,null,0,null,"","","",""]
[null,null,null,null,null,null,null,null,0,null,"","","",""]
[null,null,null,null,null,null,null,null,0,null,"","","",""]
[null,null,null,null,null,null,null,null,0,null,"","","",""]
[null,null,null,null,null,null,null,null,0,null,"","","",""]
[null,null,null,null,null,null,null,null,0,null,"","","",""]
[null,null,null,null,null,null,null,null,0,null,"","","",""]
[null,null,null,null,null,null,null,null,{"$f":"IFERROR(G522+H522,\"\")","v":0},null,{"$f":"IFERROR(IF(J522<>\"\",F522*J522,\"\"),\"\")","v":""},{"$f":"IFERROR(IF(J522<>\"\",G522*J522,\"\"),\"\")","v":""},{"$f":"IFERROR(IF(J522<>\"\",H522*J522,\"\"),\"\")","v":""},{"$f":"IFERROR(L522+M522,\"\")","v":""}]
[null,null,null,null,null,null,null,null,0,null,"","","",""]
[null,null,null,null,null,null,null,null,0,null,"","","",""]
[null,null,null,null,null,null,null,null,0,null,"","","",""]
[null,null,null,null,null,null,null,null,0,null,"","","",""]
[null,null,null,null,null,null,null,null,0,null,"","","",""]
[null,null,null,null,null,null,null,null,0,null,"","","",""]
[null,null,null,null,null,null,null,null,0,null,"","","",""]
[null,null,null,null,null,null,null,null,0,null,"","","",""]
[null,null,null,null,null,null,null,null,0,null,"","","",""]
[null,null,null,null,null,null,null,null,0,null,"","","",""]
[null,null,null,null,null,null,null,null,0,null,"","","",""]
[null,null,null,null,null,null,null,null,0,null,"","","",""]
[null,null,null,null,null,null,null,null,0,null,"","","",""]
[null,null,null,null,null,null,null,null,0,null,"","","",""]
[null,null,null,null,null,null,null,null,0,null,"","","",""]
[null,null,null,null,null,null,null,null,0,null,"","","",""]
[null,null,null,null,null,null,null,null,0,null,"","","",""]
[null,null,null,null,null,null,null,null,0,null,"","","",""]
[null,null,null,null,null,null,null,null,0,null,"","","",""]
[null,null,null,null,null,null,null,null,0,null,"","","",""]
[null,null,null,null,null,null,null,null,0,null,"","","",""]
[null,null,null,null,null,null,null,null,0,null,"","","",""]
[null,null,null,null,null,null,null,null,0,null,"","","",""]
[null,null,null,null,null,null,null,null,0,null,"","","",""]
[null,null,null,null,null,null,null,null,0,null,"","","",""]
[null,null,null,null,null,null,null,null,0,null,"","","",""]
[null,null,null,null,null,null,null,null,0,null,"","","",""]
[null,null,null,null,null,null,null,null,0,null,"","","",""]
[null,null,null,null,null,null,null,null,0,null,"","","",""]
[null,null,null,null,null,null,null,null,0,null,"","","",""]
[null,null,null,null,null,null,null,null,0,null,"","","",""]
[null,null,null,null,null,null,null,null,0,null,"","","",""]
[null,null,null,null,null,null,null,null,0,null,"","","",""]
[null,null,null,null,null,null,null,null,0,null,"","","",""]
[null,null,null,null,null,null,null,null,0,null,"","","",""]
[null,null,null,null,null,null,null,null,0,null,"","","",""]
[null,null,null,null,null,null,null,null,0,null,"","","",""]
[null,null,null,null,null,null,null,null,0,null,"","","",""]
[null,null,null,null,null,null,null,null,0,null,"","","",""]
[null,null,null,null,null,null,null,null,0,null,"","","",""]
[null,null,null,null,null,null,null,null,0,null,"","","",""]
[null,null,null,null,null,null,null,null,0,null,"","","",""]
[null,null,null,null,null,null,null,null,0,null,"","","",""]
[null,null,null,null,null,null,null,null,0,null,"","","",""]
[null,null,null,null,null,null,null,null,0,null,"","","",""]
[null,null,null,null,null,null,null,null,0,null,"","","",""]
[null,null,null,null,null,null,null,null,0,null,"","","",""]
[null,null,null,null,null,null,null,null,0,null,"","","",""]
[null,null,null,null,null,null,null,null,0,null,"","","",""]
[null,null,null,null,null,null,null,null,0,null,"","","",""]
[null,null,null,null,null,null,null,null,0,null,"","","",""]
[null,null,null,null,null,null,null,null,0,null,"","","",""]
[null,null,null,null,null,null,null,null,0,null,"","","",""]
[null,null,null,null,null,null,null,null,0,null,"","","",""]
[null,null,null,null,null,null,null,null,0,null,"","","",""]
[null,null,null,null,null,null,null,null,0,null,"","","",""]
[null,null,null,null,null,null,null,null,0,null,"","","",""]
[null,null,null,null,null,null,null,null,0,null,"","","",""]
[null,null,null,null,null,null,null,null,0,null,"","","",""]
[null,null,null,null,null,null,null,null,0,null,"","","",""]
[null,null,null,null,null,null,null,null,0,null,"","","",""]
[null,null,null,null,null,null,null,null,0,null,"","","",""]
[null,null,null,null,null,null,null,null,0,null,"","","",""]
[null,null,null,null,null,null,null,null,{"$f":"IFERROR(G586+H586,\"\")","v":0},null,{"$f":"IFERROR(IF(J586<>\"\",F586*J586,\"\"),\"\")","v":""},{"$f":"IFERROR(IF(J586<>\"\",G586*J586,\"\"),\"\")","v":""},{"$f":"IFERROR(IF(J586<>\"\",H586*J586,\"\"),\"\")","v":""},{"$f":"IFERROR(L586+M586,\"\")","v":""}]
[null,null,null,null,null,null,null,null,0,null,"","","",""]
[null,null,null,null,null,null,null,null,0,null,"","","",""]
[null,null,null,null,null,null,null,null,0,null,"","","",""]
[null,null,null,null,null,null,null,null,0,null,"","","",""]
[null,null,null,null,null,null,null,null,0,null,"","","",""]
[null,null,null,null,null,null,null,null,0,null,"","","",""]
[null,null,null,null,null,null,null,null,0,null,"","","",""]
[null,null,null,null,null,null,null,null,0,null,"","","",""]
[null,null,null,null,null,null,null,null,0,null,"","","",""]
[null,null,null,null,null,null,null,null,0,null,"","","",""]
[null,null,null,null,null,null,null,null,0,null,"","","",""]
[null,null,null,null,null,null,null,null,0,null,"","","",""]
[null,null,null,null,null,null,null,null,0,null,"","","",""]
[null,null,null,null,null,null,null,null,0,null,"","","",""]
[null,null,null,null,null,null,null,null,0,null,"","","",""]
[null,null,null,null,null,null,null,null,0,null,"","","",""]
[null,null,null,null,null,null,null,null,0,null,"","","",""]
[null,null,null,null,null,null,null,null,0,null,"","","",""]
[null,null,null,null,null,null,null,null,0,null,"","","",""]
[null,null,null,null,null,null,null,null,0,null,"","","",""]
[null,null,null,null,null,null,null,null,0,null,"","","",""]
[null,null,null,null,null,null,null,null,0,null,"","","",""]
[null,null,null,null,null,null,null,null,0,null,"","","",""]
[null,null,null,null,null,null,null,null,0,null,"","","",""]
[null,null,null,null,null,null,null,null,0,null,"","","",""]
[null,null,null,null,null,null,null,null,0,null,"","","",""]
[null,null,null,null,null,null,null,null,0,null,"","","",""]
[null,null,null,null,null,null,null,null,0,null,"","","",""]
[null,null,null,null,null,null,null,null,0,null,"","","",""]
[null,null,null,null,null,null,null,null,0,null,"","","",""]
[null,null,null,null,null,null,null,null,0,null,"","","",""]
[null,null,null,null,null,null,null,null,0,null,"","","",""]
[null,null,null,null,null,null,null,null,0,null,"","","",""]
[null,null,null,null,null,null,null,null,0,null,"","","",""]
[null,null,null,null,null,null,null,null,0,null,"","","",""]
[null,null,null,null,null,null,null,null,0,null,"","","",""]
[null,null,null,null,null,null,null,null,0,null,"","","",""]
[null,null,null,null,null,null,null,null,0,null,"","","",""]
[null,null,null,null,null,null,null,null,0,null,"","","",""]
[null,null,null,null,null,null,null,null,0,null,"","","",""]
[null,null,null,null,null,null,null,null,0,null,"","","",""]
[null,null,null,null,null,null,null,null,0,null,"","","",""]
[null,null,null,null,null,null,null,null,0,null,"","","",""]
[null,null,null,null,null,null,null,null,0,null,"","","",""]
[null,null,null,null,null,null,null,null,0,null,"","","",""]
[null,null,null,null,null,null,null,null,0,null,"","","",""]
[null,null,null,null,null,null,null,null,0,null,"","","",""]
[null,null,null,null,null,null,null,null,0,null,"","","",""]
[null,null,null,null,null,null,null,null,0,null,"","","",""]
[null,null,null,null,null,null,null,null,0,null,"","","",""]
[null,null,null,null,null,null,null,null,0,null,"","","",""]
[null,null,null,null,null,null,null,null,0,null,"","","",""]
[null,null,null,null,null,null,null,null,0,null,"","","",""]
[null,null,null,null,null,null,null,null,0,null,"","","",""]
[null,null,null,null,null,null,null,null,0,null,"","","",""]
[null,null,null,null,null,null,null,null,0,null,"","","",""]
[null,null,null,null,null,null,null,null,0,null,"","","",""]
[null,null,null,null,null,null,null,null,0,null,"","","",""]
[null,null,null,null,null,null,null,null,0,null,"","","",""]
[null,null,null,null,null,null,null,null,0,null,"","","",""]
[null,null,null,null,null,null,null,null,0,null,"","","",""]
[null,null,null,null,null,null,null,null,0,null,"","","",""]
[null,null,null,null,null,null,null,null,0,null,"","","",""]
[null,null,null,null,null,null,null,null,{"$f":"IFERROR(G650+H650,\"\")","v":0},null,{"$f":"IFERROR(IF(J650<>\"\",F650*J650,\"\"),\"\")","v":""},{"$f":"IFERROR(IF(J650<>\"\",G650*J650,\"\"),\"\")","v":""},{"$f":"IFERROR(IF(J650<>\"\",H650*J650,\"\"),\"\")","v":""},{"$f":"IFERROR(L650+M650,\"\")","v":""}]
[null,null,null,null,null,null,null,null,0,null,"","","",""]
[null,null,null,null,null,null,null,null,0,null,"","","",""]
[null,null,null,null,null,null,null,null,0,null,"","","",""]
[null,null,null,null,null,null,null,null,0,null,"","","",""]
[null,null,null,null,null,null,null,null,0,null,"","","",""]
[null,null,null,null,null,null,null,null,0,null,"","","",""]
[null,null,null,null,null,null,null,null,0,null,"","","",""]
[null,null,null,null,null,null,null,null,0,null,"","","",""]
[null,null,null,null,null,null,null,null,0,null,"","","",""]
[null,null,null,null,null,null,null,null,0,null,"","","",""]
[null,null,null,null,null,null,null,null,0,null,"","","",""]
[null,null,null,null,null,null,null,null,0,null,"","","",""]
[null,null,null,null,null,null,null,null,0,null,"","","",""]
[null,null,null,null,null,null,null,null,0,null,"","","",""]
[null,null,null,null,null,null,null,null,0,null,"","","",""]
[null,null,null,null,null,null,null,null,0,null,"","","",""]
[null,null,null,null,null,null,null,null,0,null,"","","",""]
[null,null,null,null,null,null,null,null,0,null,"","","",""]
[null,null,null,null,null,null,null,null,0,null,"","","",""]
[null,null,null,null,null,null,null,null,0,null,"","","",""]
[null,null,null,null,null,null,null,null,0,null,"","","",""]
[null,null,null,null,null,null,null,null,0,null,"","","",""]
[null,null,null,null,null,null,null,null,0,null,"","","",""]
[null,null,null,null,null,null,null,null,0,null,"","","",""]
[null,null,null,null,null,null,null,null,0,null,"","","",""]
[null,null,null,null,null,null,null,null,0,null,"","","",""]
[null,null,null,null,null,null,null,null,0,null,"","","",""]
[null,null,null,null,null,null,null,null,0,null,"","","",""]
[null,null,null,null,null,null,null,null,0,null,"","","",""]
[null,null,null,null,null,null,null,null,0,null,"","","",""]
[null,null,null,null,null,null,null,null,0,null,"","","",""]
[null,null,null,null,null,null,null,null,0,null,"","","",""]
[null,null,null,null,null,null,null,null,0,null,"","","",""]
[null,null,null,null,null,null,null,null,0,null,"","","",""]
[null,null,null,null,null,null,null,null,0,null,"","","",""]
[null,null,null,null,null,null,null,null,0,null,"","","",""]
[null,null,null,null,null,null,null,null,0,null,"","","",""]
[null,null,null,null,null,null,null,null,0,null,"","","",""]
[null,null,null,null,null,null,null,null,0,null,"","","",""]
[null,null,null,null,null,null,null,null,0,null,"","","",""]
[null,null,null,null,null,null,null,null,0,null,"","","",""]
[null,null,null,null,null,null,null,null,0,null,"","","",""]
[null,null,null,null,null,null,null,null,0,null,"","","",""]
[null,null,null,null,null,null,null,null,0,null,"","","",""]
[null,null,null,null,null,null,null,null,0,null,"","","",""]
[null,null,null,null,null,null,null,null,0,null,"","","",""]
[null,null,null,null,null,null,null,null,0,null,"","","",""]
[null,null,null,null,null,null,null,null,0,null,"","","",""]
[null,null,null,null,null,null,null,null,0,null,"","","",""]
[null,null,null,null,null,null,null,null,0,null,"","","",""]
[null,null,null,null,null,null,null,null,0,null,"","","",""]
[null,null,null,null,null,null,null,null,0,null,"","","",""]
[null,null,null,null,null,null,null,null,0,null,"","","",""]
[null,null,null,null,null,null,null,null,0,null,"","","",""]
[null,null,null,null,null,null,null,null,0,null,"","","",""]
[null,null,null,null,null,null,null,null,0,null,"","","",""]
[null,null,null,null,null,null,null,null,0,null,"","","",""]
[null,null,null,null,null,null,null,null,0,null,"","","",""]
[null,null,null,null,null,null,null,null,0,null,"","","",""]
[null,null,null,null,null,null,null,null,0,null,"","","",""]
[null,null,null,null,null,null,null,null,0,null,"","","",""]
[null,null,null,null,null,null,null,null,0,null,"","","",""]
[null,null,null,null,null,null,null,null,0,null,"","","",""]
[null,null,null,null,null,null,null,null,{"$f":"IFERROR(G714+H714,\"\")","v":0},null,{"$f":"IFERROR(IF(J714<>\"\",F714*J714,\"\"),\"\")","v":""},{"$f":"IFERROR(IF(J714<>\"\",G714*J714,\"\"),\"\")","v":""},{"$f":"IFERROR(IF(J714<>\"\",H714*J714,\"\"),\"\")","v":""},{"$f":"IFERROR(L714+M714,\"\")","v":""}]
[null,null,null,null,null,null,null,null,0,null,"","","",""]
[null,null,null,null,null,null,null,null,0,null,"","","",""]
[null,null,null,null,null,null,null,null,0,null,"","","",""]
[null,null,null,null,null,null,null,null,0,null,"","","",""]
[null,null,null,null,null,null,null,null,0,null,"","","",""]
[null,null,null,null,null,null,null,null,0,null,"","","",""]
[null,null,null,null,null,null,null,null,0,null,"","","",""]
[null,null,null,null,null,null,null,null,0,null,"","","",""]
[null,null,null,null,null,null,null,null,0,null,"","","",""]
[null,null,null,null,null,null,null,null,0,null,"","","",""]
[null,null,null,null,null,null,null,null,0,null,"","","",""]
[null,null,null,null,null,null,null,null,0,null,"","","",""]
[null,null,null,null,null,null,null,null,0,null,"","","",""]
[null,null,null,null,null,null,null,null,0,null,"","","",""]
[null,null,null,null,null,null,null,null,0,null,"","","",""]
[null,null,null,null,null,null,null,null,0,null,"","","",""]
[null,null,null,null,null,null,null,null,0,null,"","","",""]
[null,null,null,null,null,null,null,null,0,null,"","","",""]
[null,null,null,null,null,null,null,null,0,null,"","","",""]
[null,null,null,null,null,null,null,null,0,null,"","","",""]
[null,null,null,null,null,null,null,null,0,null,"","","",""]
[null,null,null,null,null,null,null,null,0,null,"","","",""]
[null,null,null,null,null,null,null,null,0,null,"","","",""]
[null,null,null,null,null,null,null,null,0,null,"","","",""]
[null,null,null,null,null,null,null,null,0,null,"","","",""]
[null,null,null,null,null,null,null,null,0,null,"","","",""]
[null,null,null,null,null,null,null,null,0,null,"","","",""]
[null,null,null,null,null,null,null,null,0,null,"","","",""]
[null,null,null,null,null,null,null,null,0,null,"","","",""]
[null,null,null,null,null,null,null,null,0,null,"","","",""]
[null,null,null,null,null,null,null,null,0,null,"","","",""]
[null,null,null,null,null,null,null,null,0,null,"","","",""]
[null,null,null,null,null,null,null,null,0,null,"","","",""]
[null,null,null,null,null,null,null,null,0,null,"","","",""]
[null,null,null,null,null,null,null,null,0,null,"","","",""]
[null,null,null,null,null,null,null,null,0,null,"","","",""]
[null,null,null,null,null,null,null,null,0,null,"","","",""]
[null,null,null,null,null,null,null,null,0,null,"","","",""]
[null,null,null,null,null,null,null,null,0,null,"","","",""]
[null,null,null,null,null,null,null,null,0,null,"","","",""]
[null,null,null,null,null,null,null,null,0,null,"","","",""]
[null,null,null,null,null,null,null,null,0,null,"","","",""]
[null,null,null,null,null,null,null,null,0,null,"","","",""]
[null,null,null,null,null,null,null,null,0,null,"","","",""]
[null,null,null,null,null,null,null,null,0,null,"","","",""]
[null,null,null,null,null,null,null,null,0,null,"","","",""]
[null,null,null,null,null,null,null,null,0,null,"","","",""]
[null,null,null,null,null,null,null,null,0,null,"","","",""]
[null,null,null,null,null,null,null,null,0,null,"","","",""]
[null,null,null,null,null,null,null,null,0,null,"","","",""]
[null,null,null,null,null,null,null,null,0,null,"","","",""]
[null,null,null,null,null,null,null,null,0,null,"","","",""]
[null,null,null,null,null,null,null,null,0,null,"","","",""]
[null,null,null,null,null,null,null,null,0,null,"","","",""]
[null,null,null,null,null,null,null,null,0,null,"","","",""]
[null,null,null,null,null,null,null,null,0,null,"","","",""]
[null,null,null,null,null,null,null,null,0,null,"","","",""]
[null,null,null,null,null,null,null,null,0,null,"","","",""]
[null,null,null,null,null,null,null,null,0,null,"","","",""]
[null,null,null,null,null,null,null,null,0,null,"","","",""]
[null,null,null,null,null,null,null,null,0,null,"","","",""]
[null,null,null,null,null,null,null,null,0,null,"","","",""]
[null,null,null,null,null,null,null,null,0,null,"","","",""]
[null,null,null,null,null,null,null,null,{"$f":"IFERROR(G778+H778,\"\")","v":0},null,{"$f":"IFERROR(IF(J778<>\"\",F778*J778,\"\"),\"\")","v":""},{"$f":"IFERROR(IF(J778<>\"\",G778*J778,\"\"),\"\")","v":""},{"$f":"IFERROR(IF(J778<>\"\",H778*J778,\"\"),\"\")","v":""},{"$f":"IFERROR(L778+M778,\"\")","v":""}]
[null,null,null,null,null,null,null,null,0,null,"","","",""]
[null,null,null,null,null,null,null,null,0,null,"","","",""]
[null,null,null,null,null,null,null,null,0,null,"","","",""]
[null,null,null,null,null,null,null,null,0,null,"","","",""]
[null,null,null,null,null,null,null,null,0,null,"","","",""]
[null,null,null,null,null,null,null,null,0,null,"","","",""]
[null,null,null,null,null,null,null,null,0,null,"","","",""]
[null,null,null,null,null,null,null,null,0,null,"","","",""]
[null,null,null,null,null,null,null,null,0,null,"","","",""]
[null,null,null,null,null,null,null,null,0,null,"","","",""]
[null,null,null,null,null,null,null,null,0,null,"","","",""]
[null,null,null,null,null,null,null,null,0,null,"","","",""]
[null,null,null,null,null,null,null,null,0,null,"","","",""]
[null,null,null,null,null,null,null,null,0,null,"","","",""]
[null,null,null,null,null,null,null,null,0,null,"","","",""]
[null,null,null,null,null,null,null,null,0,null,"","","",""]
[null,null,null,null,null,null,null,null,0,null,"","","",""]
[null,null,null,null,null,null,null,null,0,null,"","","",""]
[null,null,null,null,null,null,null,null,0,null,"","","",""]
[null,null,null,null,null,null,null,null,0,null,"","","",""]
[null,null,null,null,null,null,null,null,0,null,"","","",""]
[null,null,null,null,null,null,null,null,0,null,"","","",""]
[null,null,null,null,null,null,null,null,0,null,"","","",""]
[null,null,null,null,null,null,null,null,0,null,"","","",""]
[null,null,null,null,null,null,null,null,0,null,"","","",""]
[null,null,null,null,null,null,null,null,0,null,"","","",""]
[null,null,null,null,null,null,null,null,0,null,"","","",""]
[null,null,null,null,null,null,null,null,0,null,"","","",""]
[null,null,null,null,null,null,null,null,0,null,"","","",""]
[null,null,null,null,null,null,null,null,0,null,"","","",""]
[null,null,null,null,null,null,null,null,0,null,"","","",""]
[null,null,null,null,null,null,null,null,0,null,"","","",""]
[null,null,null,null,null,null,null,null,0,null,"","","",""]
[null,null,null,null,null,null,null,null,0,null,"","","",""]
[null,null,null,null,null,null,null,null,0,null,"","","",""]
[null,null,null,null,null,null,null,null,0,null,"","","",""]
[null,null,null,null,null,null,null,null,0,null,"","","",""]
[null,null,null,null,null,null,null,null,0,null,"","","",""]
[null,null,null,null,null,null,null,null,0,null,"","","",""]
[null,null,null,null,null,null,null,null,0,null,"","","",""]
[null,null,null,null,null,null,null,null,0,null,"","","",""]
[null,null,null,null,null,null,null,null,0,null,"","","",""]
[null,null,null,null,null,null,null,null,0,null,"","","",""]
[null,null,null,null,null,null,null,null,0,null,"","","",""]
[null,null,null,null,null,null,null,null,0,null,"","","",""]
[null,null,null,null,null,null,null,null,0,null,"","","",""]
[null,null,null,null,null,null,null,null,0,null,"","","",""]
[null,null,null,null,null,null,null,null,0,null,"","","",""]
[null,null,null,null,null,null,null,null,0,null,"","","",""]
[null,null,null,null,null,null,null,null,0,null,"","","",""]
[null,null,null,null,null,null,null,null,0,null,"","","",""]
[null,null,null,null,null,null,null,null,0,null,"","","",""]
[null,null,null,null,null,null,null,null,0,null,"","","",""]
[null,null,null,null,null,null,null,null,0,null,"","","",""]
[null,null,null,null,null,null,null,null,0,null,"","","",""]
[null,null,null,null,null,null,null,null,0,null,"","","",""]
[null,null,null,null,null,null,null,null,0,null,"","","",""]
[null,null,null,null,null,null,null,null,0,null,"","","",""]
[null,null,null,null,null,null,null,null,0,null,"","","",""]
[null,null,null,null,null,null,null,null,0,null,"","","",""]
[null,null,null,null,null,null,null,null,0,null,"","","",""]
[null,null,null,null,null,null,null,null,0,null,"","","",""]
[null,null,null,null,null,null,null,null,0,null,"","","",""]
[null,null,null,null,null,null,null,null,{"$f":"IFERROR(G842+H842,\"\")","v":0},null,{"$f":"IFERROR(IF(J842<>\"\",F842*J842,\"\"),\"\")","v":""},{"$f":"IFERROR(IF(J842<>\"\",G842*J842,\"\"),\"\")","v":""},{"$f":"IFERROR(IF(J842<>\"\",H842*J842,\"\"),\"\")","v":""},{"$f":"IFERROR(L842+M842,\"\")","v":""}]
[null,null,null,null,null,null,null,null,0,null,"","","",""]
[null,null,null,null,null,null,null,null,0,null,"","","",""]
[null,null,null,null,null,null,null,null,0,null,"","","",""]
[null,null,null,null,null,null,null,null,0,null,"","","",""]
[null,null,null,null,null,null,null,null,0,null,"","","",""]
[null,null,null,null,null,null,null,null,0,null,"","","",""]
[null,null,null,null,null,null,null,null,0,null,"","","",""]
[null,null,null,null,null,null,null,null,0,null,"","","",""]
[null,null,null,null,null,null,null,null,0,null,"","","",""]
[null,null,null,null,null,null,null,null,0,null,"","","",""]
[null,null,null,null,null,null,null,null,0,null,"","","",""]
[null,null,null,null,null,null,null,null,0,null,"","","",""]
[null,null,null,null,null,null,null,null,0,null,"","","",""]
[null,null,null,null,null,null,null,null,0,null,"","","",""]
[null,null,null,null,null,null,null,null,0,null,"","","",""]
[null,null,null,null,null,null,null,null,0,null,"","","",""]
[null,null,null,null,null,null,null,null,0,null,"","","",""]
[null,null,null,null,null,null,null,null,0,null,"","","",""]
[null,null,null,null,null,null,null,null,0,null,"","","",""]
[null,null,null,null,null,null,null,null,0,null,"","","",""]
[null,null,null,null,null,null,null,null,0,null,"","","",""]
[null,null,null,null,null,null,null,null,0,null,"","","",""]
[null,null,null,null,null,null,null,null,0,null,"","","",""]
[null,null,null,null,null,null,null,null,0,null,"","","",""]
[null,null,null,null,null,null,null,null,0,null,"","","",""]
[null,null,null,null,null,null,null,null,0,null,"","","",""]
[null,null,null,null,null,null,null,null,0,null,"","","",""]
[null,null,null,null,null,null,null,null,0,null,"","","",""]
[null,null,null,null,null,null,null,null,0,null,"","","",""]
[null,null,null,null,null,null,null,null,0,null,"","","",""]
[null,null,null,null,null,null,null,null,0,null,"","","",""]
[null,null,null,null,null,null,null,null,0,null,"","","",""]
[null,null,null,null,null,null,null,null,0,null,"","","",""]
[null,null,null,null,null,null,null,null,0,null,"","","",""]
[null,null,null,null,null,null,null,null,0,null,"","","",""]
[null,null,null,null,null,null,null,null,0,null,"","","",""]
[null,null,null,null,null,null,null,null,0,null,"","","",""]
[null,null,null,null,null,null,null,null,0,null,"","","",""]
[null,null,null,null,null,null,null,null,0,null,"","","",""]
[null,null,null,null,null,null,null,null,0,null,"","","",""]
[null,null,null,null,null,null,null,null,0,null,"","","",""]
[null,null,null,null,null,null,null,null,0,null,"","","",""]
[null,null,null,null,null,null,null,null,0,null,"","","",""]
[null,null,null,null,null,null,null,null,0,null,"","","",""]
[null,null,null,null,null,null,null,null,0,null,"","","",""]
[null,null,null,null,null,null,null,null,0,null,"","","",""]
[null,null,null,null,null,null,null,null,0,null,"","","",""]
[null,null,null,null,null,null,null,null,0,null,"","","",""]
[null,null,null,null,null,null,null,null,0,null,"","","",""]
[null,null,null,null,null,null,null,null,0,null,"","","",""]
[null,null,null,null,null,null,null,null,0,null,"","","",""]
[null,null,null,null,null,null,null,null,0,null,"","","",""]
[null,null,null,null,null,null,null,null,0,null,"","","",""]
[null,null,null,null,null,null,null,null,0,null,"","","",""]
[null,null,null,null,null,null,null,null,0,null,"","","",""]
[null,null,null,null,null,null,null,null,0,null,"","","",""]
[null,null,null,null,null,null,null,null,0,null,"","","",""]
[null,null,null,null,null,null,null,null,0,null,"","","",""]
[null,null,null,null,null,null,null,null,0,null,"","","",""]
[null,null,null,null,null,null,null,null,0,null,"","","",""]
[null,null,null,null,null,null,null,null,0,null,"","","",""]
[null,null,null,null,null,null,null,null,0,null,"","","",""]
[null,null,null,null,null,null,null,null,0,null,"","","",""]
[null,null,null,null,null,null,null,null,{"$f":"IFERROR(G906+H906,\"\")","v":0},null,{"$f":"IFERROR(IF(J906<>\"\",F906*J906,\"\"),\"\")","v":""},{"$f":"IFERROR(IF(J906<>\"\",G906*J906,\"\"),\"\")","v":""},{"$f":"IFERROR(IF(J906<>\"\",H906*J906,\"\"),\"\")","v":""},{"$f":"IFERROR(L906+M906,\"\")","v":""}]
[null,null,null,null,null,null,null,null,0,null,"","","",""]
[null,null,null,null,null,null,null,null,0,null,"","","",""]
[null,null,null,null,null,null,null,null,0,null,"","","",""]
[null,null,null,null,null,null,null,null,0,null,"","","",""]
[null,null,null,null,null,null,null,null,0,null,"","","",""]
[null,null,null,null,null,null,null,null,0,null,"","","",""]
[null,null,null,null,null,null,null,null,0,null,"","","",""]
[null,null,null,null,null,null,null,null,0,null,"","","",""]
[null,null,null,null,null,null,null,null,0,null,"","","",""]
[null,null,null,null,null,null,null,null,0,null,"","","",""]
[null,null,null,null,null,null,null,null,0,null,"","","",""]
[null,null,null,null,null,null,null,null,0,null,"","","",""]
[null,null,null,null,null,null,null,null,0,null,"","","",""]
[null,null,null,null,null,null,null,null,0,null,"","","",""]
[null,null,null,null,null,null,null,null,0,null,"","","",""]
[null,null,null,null,null,null,null,null,0,null,"","","",""]
[null,null,null,null,null,null,null,null,0,null,"","","",""]
[null,null,null,null,null,null,null,null,0,null,"","","",""]
[null,null,null,null,null,null,null,null,0,null,"","","",""]
[null,null,null,null,null,null,null,null,0,null,"","","",""]
[null,null,null,null,null,null,null,null,0,null,"","","",""]
[null,null,null,null,null,null,null,null,0,null,"","","",""]
[null,null,null,null,null,null,null,null,0,null,"","","",""]
[null,null,null,null,null,null,null,null,0,null,"","","",""]
[null,null,null,null,null,null,null,null,0,null,"","","",""]
[null,null,null,null,null,null,null,null,0,null,"","","",""]
[null,null,null,null,null,null,null,null,0,null,"","","",""]
[null,null,null,null,null,null,null,null,0,null,"","","",""]
[null,null,null,null,null,null,null,null,0,null,"","","",""]
[null,null,null,null,null,null,null,null,0,null,"","","",""]
[null,null,null,null,null,null,null,null,0,null,"","","",""]
[null,null,null,null,null,null,null,null,0,null,"","","",""]
[null,null,null,null,null,null,null,null,0,null,"","","",""]
[null,null,null,null,null,null,null,null,0,null,"","","",""]
[null,null,null,null,null,null,null,null,0,null,"","","",""]
[null,null,null,null,null,null,null,null,0,null,"","","",""]
[null,null,null,null,null,null,null,null,0,null,"","","",""]
[null,null,null,null,null,null,null,null,0,null,"","","",""]
[null,null,null,null,null,null,null,null,0,null,"","","",""]
[null,null,null,null,null,null,null,null,0,null,"","","",""]
[null,null,null,null,null,null,null,null,0,null,"","","",""]
[null,null,null,null,null,null,null,null,0,null,"","","",""]
[null,null,null,null,null,null,null,null,0,null,"","","",""]
[null,null,null,null,null,null,null,null,0,null,"","","",""]
[null,null,null,null,null,null,null,null,0,null,"","","",""]
[null,null,null,null,null,null,null,null,0,null,"","","",""]
[null,null,null,null,null,null,null,null,0,null,"","","",""]
[null,null,null,null,null,null,null,null,0,null,"","","",""]
[null,null,null,null,null,null,null,null,0,null,"","","",""]
[null,null,null,null,null,null,null,null,0,null,"","","",""]
[null,null,null,null,null,null,null,null,0,null,"","","",""]
[null,null,null,null,null,null,null,null,0,null,"","","",""]
[null,null,null,null,null,null,null,null,0,null,"","","",""]
[null,null,null,null,null,null,null,null,0,null,"","","",""]
[null,null,null,null,null,null,null,null,0,null,"","","",""]
[null,null,null,null,null,null,null,null,0,null,"","","",""]
[null,null,null,null,null,null,null,null,0,null,"","","",""]
[null,null,null,null,null,null,null,null,0,null,"","","",""]
[null,null,null,null,null,null,null,null,0,null,"","","",""]
[null,null,null,null,null,null,null,null,0,null,"","","",""]
[null,null,null,null,null,null,null,null,0,null,"","","",""]
[null,null,null,null,null,null,null,null,0,null,"","","",""]
[null,null,null,null,null,null,null,null,0,null,"","","",""]
[null,null,null,null,null,null,null,null,{"$f":"IFERROR(G970+H970,\"\")","v":0},null,{"$f":"IFERROR(IF(J970<>\"\",F970*J970,\"\"),\"\")","v":""},{"$f":"IFERROR(IF(J970<>\"\",G970*J970,\"\"),\"\")","v":""},{"$f":"IFERROR(IF(J970<>\"\",H970*J970,\"\"),\"\")","v":""},{"$f":"IFERROR(L970+M970,\"\")","v":""}]
[null,null,null,null,null,null,null,null,0,null,"","",""]
[null,null,null,null,null,null,null,null,0,null,"","","",""]
[null,null,null,null,null,null,null,null,0,null,"","","",""]
[null,null,null,null,null,null,null,null,0,null,"","","",""]
[null,null,null,null,null,null,null,null,0,null,"","","",""]
[null,null,null,null,null,null,null,null,0,null,"","","",""]
[null,null,null,null,null,null,null,null,0,null,"","","",""]
[null,null,null,null,null,null,null,null,0,null,"","","",""]
[null,null,null,null,null,null,null,null,0,null,"","","",""]
[null,null,null,null,null,null,null,null,0,null,"","","",""]
[null,null,null,null,null,null,null,null,0,null,"","","",""]
[null,null,null,null,null,null,null,null,0,null,"","","",""]
[null,null,null,null,null,null,null,null,0,null,"","","",""]
[null,null,null,null,null,null,null,null,0,null,"","","",""]
[null,null,null,null,null,null,null,null,0,null,"","","",""]
[null,null,null,null,null,null,null,null,0,null,"","","",""]
[null,null,null,null,null,null,null,null,0,null,"","","",""]
[null,null,null,null,null,null,null,null,0,null,"","","",""]
[null,null,null,null,null,null,null,null,0,null,"","","",""]
[null,null,null,null,null,null,null,null,0,null,"","","",""]
[null,null,null,null,null,null,null,null,0,null,"","","",""]
[null,null,null,null,null,null,null,null,0,null,"","","",""]
[null,null,null,null,null,null,null,null,0,null,"","","",""]
[null,null,null,null,null,null,null,null,0,null,"","","",""]
[null,null,null,null,null,null,null,null,0,null,"","","",""]
[null,null,null,null,null,null,null,null,0,null,"","","",""]
[null,null,null,null,null,null,null,null,0,null,"","","",""]
[null,null,null,null,null,null,null,null,0,null,"","","",""]
[null,null,null,null,null,null,null,null,0,null,{"$f":"IFERROR(IF(J999<>\"\",F999*J999,\"\"),\"\")","v":""},{"$f":"IFERROR(IF(J999<>\"\",G999*J999,\"\"),\"\")","v":""},{"$f":"IFERROR(IF(J999<>\"\",H999*J999,\"\"),\"\")","v":""},{"$f":"IFERROR(L999+M999,\"\")","v":""}]
[null,null,null,null,null,null,null,null,0,null,"","","",""]
[null,null,null,null,null,null,null,null,0,null,"","","",""]
[null,null,null,null,null,null,null,null,0,null,"","","",""]
[null,null,null,null,null,null,null,null,0,null,"","","",""]
[null,null,null,null,null,null,null,null,0,null,"","","",""]
[null,null,null,null,null,null,null,null,0,null,"","","",""]
[null,null,null,null,null,null,null,null,0,null,"","","",""]
[null,null,null,null,null,null,null,null,0,null,"","","",""]
[null,null,null,null,null,null,null,null,0,null,"","","",""]
[null,null,null,null,null,null,null,null,0,null,"","","",""]
[null,null,null,null,null,null,null,null,0,null,"","","",""]
[null,null,null,null,null,null,null,null,0,null,"","","",""]
[null,null,null,null,null,null,null,null,0,null,"","","",""]
[null,null,null,null,null,null,null,null,0,null,"","","",""]
[null,null,null,null,null,null,null,null,0,null,"","","",""]
[null,null,null,null,null,null,null,null,0,null,"","","",""]
[null,null,null,null,null,null,null,null,0,null,"","","",""]
[null,null,null,null,null,null,null,null,0,null,"","","",""]
[null,null,null,null,null,null,null,null,0,null,"","","",""]
[null,null,null,null,null,null,null,null,0,null,"","","",""]
[null,null,null,null,null,null,null,null,0,null,"","","",""]
[null,null,null,null,null,null,null,null,0,null,"","","",""]
[null,null,null,null,null,null,null,null,0,null,"","","",""]
[null,null,null,null,null,null,null,null,0,null,"","","",""]
[null,null,null,null,null,null,null,null,0,null,"","","",""]
[null,null,null,null,null,null,null,null,0,null,"","","",""]
[null,null,null,null,null,null,null,null,0,null,"","","",""]
[null,null,null,null,null,null,null,null,0,null,"","","",""]
[null,null,null,null,null,null,null,null,0,null,"","","",""]
[null,null,null,null,null,null,null,null,0,null,"","","",""]
[null,null,null,null,null,null,null,null,0,null,"","","",""]
[null,null,null,null,null,null,null,null,0,null,"","","",""]
[null,null,null,null,null,null,null,null,0,null,"","","",""]
[null,null,null,null,null,null,null,null,0,null,"","","",""]
[null,null,null,null,null,null,null,null,{"$f":"IFERROR(G1034+H1034,\"\")","v":0},null,"","","",""]
[null,null,null,null,null,null,null,null,0,null,"","","",""]
[null,null,null,null,null,null,null,null,0,null,"","","",""]
[null,null,null,null,null,null,null,null,0,null,"","","",""]
[null,null,null,null,null,null,null,null,0,null,"","","",""]
[null,null,null,null,null,null,null,null,0,null,"","","",""]
[null,null,null,null,null,null,null,null,0,null,"","","",""]
[null,null,null,null,null,null,null,null,0,null,"","","",""]
[null,null,null,null,null,null,null,null,0,null,"","","",""]
[null,null,null,null,null,null,null,null,0,null,"","","",""]
[null,null,null,null,null,null,null,null,0,null,"","","",""]
[null,null,null,null,null,null,null,null,0,null,"","","",""]
[null,null,null,null,null,null,null,null,0,null,"","","",""]
[null,null,null,null,null,null,null,null,0,null,"","","",""]
[null,null,null,null,null,null,null,null,0,null,"","","",""]
[null,null,null,null,null,null,null,null,0,null,"","","",""]
[null,null,null,null,null,null,null,null,0,null,"","","",""]
[null,null,null,null,null,null,null,null,0,null,"","","",""]
[null,null,null,null,null,null,null,null,0,null,"","","",""]
[null,null,null,null,null,null,null,null,0,null,"","","",""]
[null,null,null,null,null,null,null,null,0,null,"","","",""]
[null,null,null,null,null,null,null,null,0,null,"","","",""]
[null,null,null,null,null,null,null,null,0,null,"","","",""]
[null,null,null,null,null,null,null,null,0,null,"","","",""]
[null,null,null,null,null,null,null,null,0,null,"","","",""]
[null,null,null,null,null,null,null,null,0,null,"","","",""]
[null,null,null,null,null,null,null,null,0,null,"","","",""]
[null,null,null,null,null,null,null,null,0,null,"","","",""]
[null,null,null,null,null,null,null,null,0,null,"","","",""]
[null,null,null,null,null,null,null,null,0,null,{"$f":"IFERROR(IF(J1063<>\"\",F1063*J1063,\"\"),\"\")","v":""},{"$f":"IFERROR(IF(J1063<>\"\",G1063*J1063,\"\"),\"\")","v":""},{"$f":"IFERROR(IF(J1063<>\"\",H1063*J1063,\"\"),\"\")","v":""},{"$f":"IFERROR(L1063+M1063,\"\")","v":""}]
[null,null,null,null,null,null,null,null,0,null,"","","",""]
[null,null,null,null,null,null,null,null,0,null,"","","",""]
[null,null,null,null,null,null,null,null,0,null,"","","",""]
[null,null,null,null,null,null,null,null,0,null,"","","",""]
[null,null,null,null,null,null,null,null,0,null,"","","",""]
[null,null,null,null,null,null,null,null,0,null,"","","",""]
[null,null,null,null,null,null,null,null,0,null,"","","",""]
[null,null,null,null,null,null,null,null,0,null,"","","",""]
[null,null,null,null,null,null,null,null,0,null,"","","",""]
[null,null,null,null,null,null,null,null,0,null,"","","",""]
[null,null,null,null,null,null,null,null,0,null,"","","",""]
[null,null,null,null,null,null,null,null,0,null,"","","",""]
[null,null,null,null,null,null,null,null,0,null,"","","",""]
[null,null,null,null,null,null,null,null,0,null,"","","",""]
[null,null,null,null,null,null,null,null,0,null,"","","",""]
[null,null,null,null,null,null,null,null,0,null,"","","",""]
[null,null,null,null,null,null,null,null,0,null,"","","",""]
[null,null,null,null,null,null,null,null,0,null,"","","",""]
[null,null,null,null,null,null,null,null,0,null,"","","",""]
[null,null,null,null,null,null,null,null,0,null,"","","",""]
[null,null,null,null,null,null,null,null,0,null,"","","",""]
[null,null,null,null,null,null,null,null,0,null,"","","",""]
[null,null,null,null,null,null,null,null,0,null,"","","",""]
[null,null,null,null,null,null,null,null,0,null,"","","",""]
[null,null,null,null,null,null,null,null,0,null,"","","",""]
[null,null,null,null,null,null,null,null,0,null,"","","",""]
[null,null,null,null,null,null,null,null,0,null,"","","",""]
[null,null,null,null,null,null,null,null,0,null,"","","",""]
[null,null,null,null,null,null,null,null,0,null,"","","",""]
[null,null,null,null,null,null,null,null,0,null,"","","",""]
[null,null,null,null,null,null,null,null,0,null,"","","",""]
[null,null,null,null,null,null,null,null,0,null,"","","",""]
[null,null,null,null,null,null,null,null,0,null,"","","",""]
[null,null,null,null,null,null,null,null,0,null,"","","",""]
[null,null,null,null,null,null,null,null,{"$f":"IFERROR(G1098+H1098,\"\")","v":0},null,"","","",""]
[null,null,null,null,null,null,null,null,0,null,"","","",""]
[null,null,null,null,null,null,null,null,0,null,"","","",""]
[null,null,null,null,null,null,null,null,0,null,"","","",""]
[null,null,null,null,null,null,null,null,0,null,"","","",""]
[null,null,null,null,null,null,null,null,0,null,"","","",""]
[null,null,null,null,null,null,null,null,0,null,"","","",""]
[null,null,null,null,null,null,null,null,0,null,"","","",""]
[null,null,null,null,null,null,null,null,0,null,"","","",""]
[null,null,null,null,null,null,null,null,0,null,"","","",""]
[null,null,null,null,null,null,null,null,0,null,"","","",""]
[null,null,null,null,null,null,null,null,0,null,"","","",""]
[null,null,null,null,null,null,null,null,0,null,"","","",""]
[null,null,null,null,null,null,null,null,0,null,"","","",""]
[null,null,null,null,null,null,null,null,0,null,"","","",""]
[null,null,null,null,null,null,null,null,0,null,"","","",""]
[null,null,null,null,null,null,null,null,0,null,"","","",""]
[null,null,null,null,null,null,null,null,0,null,"","","",""]
[null,null,null,null,null,null,null,null,0,null,"","","",""]
[null,null,null,null,null,null,null,null,0,null,"","","",""]
[null,null,null,null,null,null,null,null,0,null,"","","",""]
[null,null,null,null,null,null,null,null,0,null,"","","",""]
[null,null,null,null,null,null,null,null,0,null,"","","",""]
[null,null,null,null,null,null,null,null,0,null,"","","",""]
[null,null,null,null,null,null,null,null,0,null,"","","",""]
[null,null,null,null,null,null,null,null,0,null,"","","",""]
[null,null,null,null,null,null,null,null,0,null,"","","",""]
[null,null,null,null,null,null,null,null,0,null,"","","",""]
[null,null,null,null,null,null,null,null,0,null,"","","",""]
[null,null,null,null,null,null,null,null,0,null,{"$f":"IFERROR(IF(J1127<>\"\",F1127*J1127,\"\"),\"\")","v":""},{"$f":"IFERROR(IF(J1127<>\"\",G1127*J1127,\"\"),\"\")","v":""},{"$f":"IFERROR(IF(J1127<>\"\",H1127*J1127,\"\"),\"\")","v":""},{"$f":"IFERROR(L1127+M1127,\"\")","v":""}]
[null,null,null,null,null,null,null,null,0,null,"","","",""]
[null,null,null,null,null,null,null,null,0,null,"","","",""]
[null,null,null,null,null,null,null,null,0,null,"","","",""]
[null,null,null,null,null,null,null,null,0,null,"","","",""]
[null,null,null,null,null,null,null,null,0,null,"","","",""]
[null,null,null,null,null,null,null,null,0,null,"","","",""]
[null,null,null,null,null,null,null,null,0,null,"","","",""]
[null,null,null,null,null,null,null,null,0,null,"","","",""]
[null,null,null,null,null,null,null,null,0,null,"","","",""]
[null,null,null,null,null,null,null,null,0,null,"","","",""]
[null,null,null,null,null,null,null,null,0,null,"","","",""]
[null,null,null,null,null,null,null,null,0,null,"","","",""]
[null,null,null,null,null,null,null,null,0,null,"","","",""]
[null,null,null,null,null,null,null,null,0,null,"","","",""]
[null,null,null,null,null,null,null,null,0,null,"","","",""]
[null,null,null,null,null,null,null,null,0,null,"","","",""]
[null,null,null,null,null,null,null,null,0,null,"","","",""]
[null,null,null,null,null,null,null,null,0,null,"","","",""]
[null,null,null,null,null,null,null,null,0,null,"","","",""]
[null,null,null,null,null,null,null,null,0,null,"","","",""]
[null,null,null,null,null,null,null,null,0,null,"","","",""]
[null,null,null,null,null,null,null,null,0,null,"","","",""]
[null,null,null,null,null,null,null,null,0,null,"","","",""]
[null,null,null,null,null,null,null,null,0,null,"","","",""]
[null,null,null,null,null,null,null,null,0,null,"","","",""]
[null,null,null,null,null,null,null,null,0,null,"","","",""]
[null,null,null,null,null,null,null,null,0,null,"","","",""]
[null,null,null,null,null,null,null,null,0,null,"","","",""]
[null,null,null,null,null,null,null,null,0,null,"","","",""]
[null,null,null,null,null,null,null,null,0,null,"","","",""]
[null,null,null,null,null,null,null,null,0,null,"","","",""]
[null,null,null,null,null,null,null,null,0,null,"","","",""]
[null,null,null,null,null,null,null,null,0,null,"","","",""]
[null,null,null,null,null,null,null,null,0,null,"","","",""]
[null,null,null,null,null,null,null,null,{"$f":"IFERROR(G1162+H1162,\"\")","v":0},null,"","","",""]
[null,null,null,null,null,null,null,null,0,null,"","","",""]
[null,null,null,null,null,null,null,null,0,null,"","","",""]
[null,null,null,null,null,null,null,null,0,null,"","","",""]
[null,null,null,null,null,null,null,null,0,null,"","","",""]
[null,null,null,null,null,null,null,null,0,null,"","","",""]
[null,null,null,null,null,null,null,null,0,null,"","","",""]
[null,null,null,null,null,null,null,null,0,null,"","","",""]
[null,null,null,null,null,null,null,null,0,null,"","","",""]
[null,null,null,null,null,null,null,null,0,null,"","","",""]
[null,null,null,null,null,null,null,null,0,null,"","","",""]
[null,null,null,null,null,null,null,null,0,null,"","","",""]
[null,null,null,null,null,null,null,null,0,null,"","","",""]
[null,null,null,null,null,null,null,null,0,null,"","","",""]
[null,null,null,null,null,null,null,null,0,null,"","","",""]
[null,null,null,null,null,null,null,null,0,null,"","","",""]
[null,null,null,null,null,null,null,null,0,null,"","","",""]
[null,null,null,null,null,null,null,null,0,null,"","","",""]
[null,null,null,null,null,null,null,null,0,null,"","","",""]
[null,null,null,null,null,null,null,null,0,null,"","","",""]
[null,null,null,null,null,null,null,null,0,null,"","","",""]
[null,null,null,null,null,null,null,null,0,null,"","","",""]
[null,null,null,null,null,null,null,null,0,null,"","","",""]
[null,null,null,null,null,null,null,null,0,null,"","","",""]
[null,null,null,null,null,null,null,null,0,null,"","","",""]
[null,null,null,null,null,null,null,null,0,null,"","","",""]
[null,null,null,null,null,null,null,null,0,null,"","","",""]
[null,null,null,null,null,null,null,null,0,null,"","","",""]
[null,null,null,null,null,null,null,null,0,null,"","","",""]
[null,null,null,null,null,null,null,null,0,null,{"$f":"IFERROR(IF(J1191<>\"\",F1191*J1191,\"\"),\"\")","v":""},{"$f":"IFERROR(IF(J1191<>\"\",G1191*J1191,\"\"),\"\")","v":""},{"$f":"IFERROR(IF(J1191<>\"\",H1191*J1191,\"\"),\"\")","v":""},{"$f":"IFERROR(L1191+M1191,\"\")","v":""}]
[null,null,null,null,null,null,null,null,0,null,"","","",""]
[null,null,null,null,null,null,null,null,0,null,"","","",""]
[null,null,null,null,null,null,null,null,0,null,"","","",""]
[null,null,null,null,null,null,null,null,0,null,"","","",""]
[null,null,null,null,null,null,null,null,0,null,"","","",""]
[null,null,null,null,null,null,null,null,0,null,"","","",""]
[null,null,null,null,null,null,null,null,0,null,"","","",""]
[null,null,null,null,null,null,null,null,0,null,"","","",""]
[null,null,null,null,null,null,null,null,0,null,"","","",""]
[null,null,null,null,null,null,null,null,0,null,"","","",""]
[null,null,null,null,null,null,null,null,0,null,"","","",""]
[null,null,null,null,null,null,null,null,0,null,"","","",""]
[null,null,null,null,null,null,null,null,0,null,"","","",""]
[null,null,null,null,null,null,null,null,0,null,"","","",""]
[null,null,null,null,null,null,null,null,0,null,"","","",""]
[null,null,null,null,null,null,null,null,0,null,"","","",""]
[null,null,null,null,null,null,null,null,0,null,"","","",""]
[null,null,null,null,null,null,null,null,0,null,"","","",""]
[null,null,null,null,null,null,null,null,0,null,"","","",""]
[null,null,null,null,null,null,null,null,0,null,"","","",""]
[null,null,null,null,null,null,null,null,0,null,"","","",""]
[null,null,null,null,null,null,null,null,0,null,"","","",""]
[null,null,null,null,null,null,null,null,0,null,"","","",""]
[null,null,null,null,null,null,null,null,0,null,"","","",""]
[null,null,null,null,null,null,null,null,0,null,"","","",""]
[null,null,null,null,null,null,null,null,0,null,"","","",""]
[null,null,null,null,null,null,null,null,0,null,"","","",""]
[null,null,null,null,null,null,null,null,0,null,"","","",""]
[null,null,null,null,null,null,null,null,0,null,"","","",""]
[null,null,null,null,null,null,null,null,0,null,"","","",""]
[null,null,null,null,null,null,null,null,0,null,"","","",""]
[null,null,null,null,null,null,null,null,0,null,"","","",""]
[null,null,null,null,null,null,null,null,0,null,"","","",""]
[null,null,null,null,null,null,null,null,0,null,"","","",""]
[null,null,null,null,null,null,null,null,{"$f":"IFERROR(G1226+H1226,\"\")","v":0},null,"","","",""]
[null,null,null,null,null,null,null,null,0,null,"","","",""]
[null,null,null,null,null,null,null,null,0,null,"","","",""]
[null,null,null,null,null,null,null,null,0,null,"","","",""]
[null,null,null,null,null,null,null,null,0,null,"","","",""]
[null,null,null,null,null,null,null,null,0,null,"","","",""]
[null,null,null,null,null,null,null,null,0,null,"","","",""]
[null,null,null,null,null,null,null,null,0,null,"","","",""]
[null,null,null,null,null,null,null,null,0,null,"","","",""]
[null,null,null,null,null,null,null,null,0,null,"","","",""]
[null,null,null,null,null,null,null,null,0,null,"","","",""]
[null,null,null,null,null,null,null,null,0,null,"","","",""]
[null,null,null,null,null,null,null,null,0,null,"","","",""]
[null,null,null,null,null,null,null,null,0,null,"","","",""]
[null,null,null,null,null,null,null,null,0,null,"","","",""]
[null,null,null,null,null,null,null,null,0,null,"","","",""]
[null,null,null,null,null,null,null,null,0,null,"","","",""]
[null,null,null,null,null,null,null,null,0,null,"","","",""]
[null,null,null,null,null,null,null,null,0,null,"","","",""]
[null,null,null,null,null,null,null,null,0,null,"","","",""]
[null,null,null,null,null,null,null,null,0,null,"","","",""]
[null,null,null,null,null,null,null,null,0,null,"","","",""]
[null,null,null,null,null,null,null,null,0,null,"","","",""]
[null,null,null,null,null,null,null,null,0,null,"","","",""]
[null,null,null,null,null,null,null,null,0,null,"","","",""]
[null,null,null,null,null,null,null,null,0,null,"","","",""]
[null,null,null,null,null,null,null,null,0,null,"","","",""]
[null,null,null,null,null,null,null,null,0,null,"","","",""]
[null,null,null,null,null,null,null,null,0,null,"","","",""]
[null,null,null,null,null,null,null,null,0,null,{"$f":"IFERROR(IF(J1255<>\"\",F1255*J1255,\"\"),\"\")","v":""},{"$f":"IFERROR(IF(J1255<>\"\",G1255*J1255,\"\"),\"\")","v":""},{"$f":"IFERROR(IF(J1255<>\"\",H1255*J1255,\"\"),\"\")","v":""},{"$f":"IFERROR(L1255+M1255,\"\")","v":""}]
[null,null,null,null,null,null,null,null,0,null,"","","",""]
[null,null,null,null,null,null,null,null,0,null,"","","",""]
[null,null,null,null,null,null,null,null,0,null,"","","",""]
[null,null,null,null,null,null,null,null,0,null,"","","",""]
[null,null,null,null,null,null,null,null,0,null,"","","",""]
[null,null,null,null,null,null,null,null,0,null,"","","",""]
[null,null,null,null,null,null,null,null,0,null,"","","",""]
[null,null,null,null,null,null,null,null,0,null,"","","",""]
[null,null,null,null,null,null,null,null,0,null,"","","",""]
[null,null,null,null,null,null,null,null,0,null,"","","",""]
[null,null,null,null,null,null,null,null,0,null,"","","",""]
[null,null,null,null,null,null,null,null,0,null,"","","",""]
[null,null,null,null,null,null,null,null,0,null,"","","",""]
[null,null,null,null,null,null,null,null,0,null,"","","",""]
[null,null,null,null,null,null,null,null,0,null,"","","",""]
[null,null,null,null,null,null,null,null,0,null,"","","",""]
[null,null,null,null,null,null,null,null,0,null,"","","",""]
[null,null,null,null,null,null,null,null,0,null,"","","",""]
[null,null,null,null,null,null,null,null,0,null,"","","",""]
[null,null,null,null,null,null,null,null,0,null,"","","",""]
[null,null,null,null,null,null,null,null,0,null,"","","",""]
[null,null,null,null,null,null,null,null,0,null,"","","",""]
[null,null,null,null,null,null,null,null,0,null,"","","",""]
[null,null,null,null,null,null,null,null,0,null,"","","",""]
[null,null,null,null,null,null,null,null,0,null,"","","",""]
[null,null,null,null,null,null,null,null,0,null,"","","",""]
[null,null,null,null,null,null,null,null,0,null,"","","",""]
[null,null,null,null,null,null,null,null,0,null,"","","",""]
[null,null,null,null,null,null,null,null,0,null,"","","",""]
[null,null,null,null,null,null,null,null,0,null,"","","",""]
[null,null,null,null,null,null,null,null,0,null,"","","",""]
[null,null,null,null,null,null,null,null,0,null,"","","",""]
[null,null,null,null,null,null,null,null,0,null,"","","",""]
[null,null,null,null,null,null,null,null,0,null,"","","",""]
[null,null,null,null,null,null,null,null,{"$f":"IFERROR(G1290+H1290,\"\")","v":0},null,"","","",""]
[null,null,null,null,null,null,null,null,0,null,"","","",""]
[null,null,null,null,null,null,null,null,0,null,"","","",""]
[null,null,null,null,null,null,null,null,0,null,"","","",""]
[null,null,null,null,null,null,null,null,0,null,"","","",""]
[null,null,null,null,null,null,null,null,0,null,"","","",""]
[null,null,null,null,null,null,null,null,0,null,"","","",""]
[null,null,null,null,null,null,null,null,0,null,"","","",""]
[null,null,null,null,null,null,null,null,0,null,"","","",""]
[null,null,null,null,null,null,null,null,0,null,"","","",""]
[null,null,null,null,null,null,null,null,0,null,"","","",""]
[null,null,null,null,null,null,null,null,0,null,"","","",""]
[null,null,null,null,null,null,null,null,0,null,"","","",""]
[null,null,null,null,null,null,null,null,0,null,"","","",""]
[null,null,null,null,null,null,null,null,0,null,"","","",""]
[null,null,null,null,null,null,null,null,0,null,"","","",""]
[null,null,null,null,null,null,null,null,0,null,"","","",""]
[null,null,null,null,null,null,null,null,0,null,"","","",""]
[null,null,null,null,null,null,null,null,0,null,"","","",""]
[null,null,null,null,null,null,null,null,0,null,"","","",""]
[null,null,null,null,null,null,null,null,0,null,"","","",""]
[null,null,null,null,null,null,null,null,0,null,"","","",""]
[null,null,null,null,null,null,null,null,0,null,"","","",""]
[null,null,null,null,null,null,null,null,0,null,"","","",""]
[null,null,null,null,null,null,null,null,0,null,"","","",""]
[null,null,null,null,null,null,null,null,0,null,"","","",""]
[null,null,null,null,null,null,null,null,0,null,"","","",""]
[null,null,null,null,null,null,null,null,0,null,"","","",""]
[null,null,null,null,null,null,null,null,0,null,"","","",""]
[null,null,null,null,null,null,null,null,0,null,{"$f":"IFERROR(IF(J1319<>\"\",F1319*J1319,\"\"),\"\")","v":""},{"$f":"IFERROR(IF(J1319<>\"\",G1319*J1319,\"\"),\"\")","v":""},{"$f":"IFERROR(IF(J1319<>\"\",H1319*J1319,\"\"),\"\")","v":""},{"$f":"IFERROR(L1319+M1319,\"\")","v":""}]
[null,null,null,null,null,null,null,null,0,null,"","","",""]
[null,null,null,null,null,null,null,null,0,null,"","","",""]
[null,null,null,null,null,null,null,null,0,null,"","","",""]
[null,null,null,null,null,null,null,null,0,null,"","","",""]
[null,null,null,null,null,null,null,null,0,null,"","","",""]
[null,null,null,null,null,null,null,null,0,null,"","","",""]
[null,null,null,null,null,null,null,null,0,null,"","","",""]
[null,null,null,null,null,null,null,null,0,null,"","","",""]
[null,null,null,null,null,null,null,null,0,null,"","","",""]
[null,null,null,null,null,null,null,null,0,null,"","","",""]
[null,null,null,null,null,null,null,null,0,null,"","","",""]
[null,null,null,null,null,null,null,null,0,null,"","","",""]
[null,null,null,null,null,null,null,null,0,null,"","","",""]
[null,null,null,null,null,null,null,null,0,null,"","","",""]
[null,null,null,null,null,null,null,null,0,null,"","","",""]
[null,null,null,null,null,null,null,null,0,null,"","","",""]
[null,null,null,null,null,null,null,null,0,null,"","","",""]
[null,null,null,null,null,null,null,null,0,null,"","","",""]
[null,null,null,null,null,null,null,null,0,null,"","","",""]
[null,null,null,null,null,null,null,null,0,null,"","","",""]
[null,null,null,null,null,null,null,null,0,null,"","","",""]
[null,null,null,null,null,null,null,null,0,null,"","","",""]
[null,null,null,null,null,null,null,null,0,null,"","","",""]
[null,null,null,null,null,null,null,null,0,null,"","","",""]
[null,null,null,null,null,null,null,null,0,null,"","","",""]
[null,null,null,null,null,null,null,null,0,null,"","","",""]
[null,null,null,null,null,null,null,null,0,null,"","","",""]
[null,null,null,null,null,null,null,null,0,null,"","","",""]
[null,null,null,null,null,null,null,null,0,null,"","","",""]
[null,null,null,null,null,null,null,null,0,null,"","","",""]
[null,null,null,null,null,null,null,null,0,null,"","","",""]
[null,null,null,null,null,null,null,null,0,null,"","","",""]
[null,null,null,null,null,null,null,null,0,null,"","","",""]
[null,null,null,null,null,null,null,null,0,null,"","","",""]
[null,null,null,null,null,null,null,null,{"$f":"IFERROR(G1354+H1354,\"\")","v":0},null,"","","",""]
[null,null,null,null,null,null,null,null,0,null,"","","",""]
[null,null,null,null,null,null,null,null,0,null,"","","",""]
[null,null,null,null,null,null,null,null,0,null,"","","",""]
[null,null,null,null,null,null,null,null,0,null,"","","",""]
[null,null,null,null,null,null,null,null,0,null,"","","",""]
[null,null,null,null,null,null,null,null,0,null,"","","",""]
[null,null,null,null,null,null,null,null,0,null,"","","",""]
[null,null,null,null,null,null,null,null,0,null,"","","",""]
[null,null,null,null,null,null,null,null,0,null,"","","",""]
[null,null,null,null,null,null,null,null,0,null,"","","",""]
[null,null,null,null,null,null,null,null,0,null,"","","",""]
[null,null,null,null,null,null,null,null,0,null,"","","",""]
[null,null,null,null,null,null,null,null,0,null,"","","",""]
[null,null,null,null,null,null,null,null,0,null,"","","",""]
[null,null,null,null,null,null,null,null,0,null,"","","",""]
[null,null,null,null,null,null,null,null,0,null,"","","",""]
[null,null,null,null,null,null,null,null,0,null,"","","",""]
[null,null,null,null,null,null,null,null,0,null,"","","",""]
[null,null,null,null,null,null,null,null,0,null,"","","",""]
[null,null,null,null,null,null,null,null,0,null,"","","",""]
[null,null,null,null,null,null,null,null,0,null,"","","",""]
[null,null,null,null,null,null,null,null,0,null,"","","",""]
[null,null,null,null,null,null,null,null,0,null,"","","",""]
[null,null,null,null,null,null,null,null,0,null,"","","",""]
[null,null,null,null,null,null,null,null,0,null,"","","",""]
[null,null,null,null,null,null,null,null,0,null,"","","",""]
[null,null,null,null,null,null,null,null,0,null,"","","",""]
[null,null,null,null,null,null,null,null,0,null,"","","",""]
[null,null,null,null,null,null,null,null,0,null,{"$f":"IFERROR(IF(J1383<>\"\",F1383*J1383,\"\"),\"\")","v":""},{"$f":"IFERROR(IF(J1383<>\"\",G1383*J1383,\"\"),\"\")","v":""},{"$f":"IFERROR(IF(J1383<>\"\",H1383*J1383,\"\"),\"\")","v":""},{"$f":"IFERROR(L1383+M1383,\"\")","v":""}]
[null,null,null,null,null,null,null,null,0,null,"","","",""]
[null,null,null,null,null,null,null,null,0,null,"","","",""]
[null,null,null,null,null,null,null,null,0,null,"","","",""]
[null,null,null,null,null,null,null,null,0,null,"","","",""]
[null,null,null,null,null,null,null,null,0,null,"","","",""]
[null,null,null,null,null,null,null,null,0,null,"","","",""]
[null,null,null,null,null,null,null,null,0,null,"","","",""]
[null,null,null,null,null,null,null,null,0,null,"","","",""]
[null,null,null,null,null,null,null,null,0,null,"","","",""]
[null,null,null,null,null,null,null,null,0,null,"","","",""]
[null,null,null,null,null,null,null,null,0,null,"","","",""]
[null,null,null,null,null,null,null,null,0,null,"","","",""]
[null,null,null,null,null,null,null,null,0,null,"","","",""]
[null,null,null,null,null,null,null,null,0,null,"","","",""]
[null,null,null,null,null,null,null,null,0,null,"","","",""]
[null,null,null,null,null,null,null,null,0,null,"","","",""]
[null,null,null,null,null,null,null,null,0,null,"","","",""]
[null,null,null,null,null,null,null,null,0,null,"","","",""]
[null,null,null,null,null,null,null,null,0,null,"","","",""]
[null,null,null,null,null,null,null,null,0,null,"","","",""]
[null,null,null,null,null,null,null,null,0,null,"","","",""]
[null,null,null,null,null,null,null,null,0,null,"","","",""]
[null,null,null,null,null,null,null,null,0,null,"","","",""]
[null,null,null,null,null,null,null,null,0,null,"","","",""]
[null,null,null,null,null,null,null,null,0,null,"","","",""]
[null,null,null,null,null,null,null,null,0,null,"","","",""]
[null,null,null,null,null,null,null,null,0,null,"","","",""]
[null,null,null,null,null,null,null,null,0,null,"","","",""]
[null,null,null,null,null,null,null,null,0,null,"","","",""]
[null,null,null,null,null,null,null,null,0,null,"","","",""]
[null,null,null,null,null,null,null,null,0,null,"","","",""]
[null,null,null,null,null,null,null,null,0,null,"","","",""]
[null,null,null,null,null,null,null,null,0,null,"","","",""]
[null,null,null,null,null,null,null,null,0,null,"","","",""]
[null,null,null,null,null,null,null,null,{"$f":"IFERROR(G1418+H1418,\"\")","v":0},null,"","","",""]
[null,null,null,null,null,null,null,null,0,null,"","","",""]
[null,null,null,null,null,null,null,null,0,null,"","","",""]
[null,null,null,null,null,null,null,null,0,null,"","","",""]
[null,null,null,null,null,null,null,null,0,null,"","","",""]
[null,null,null,null,null,null,null,null,0,null,"","","",""]
[null,null,null,null,null,null,null,null,0,null,"","","",""]
[null,null,null,null,null,null,null,null,0,null,"","","",""]
[null,null,null,null,null,null,null,null,0,null,"","","",""]
[null,null,null,null,null,null,null,null,0,null,"","","",""]
[null,null,null,null,null,null,null,null,0,null,"","","",""]
[null,null,null,null,null,null,null,null,0,null,"","","",""]
[null,null,null,null,null,null,null,null,0,null,"","","",""]
[null,null,null,null,null,null,null,null,0,null,"","","",""]
[null,null,null,null,null,null,null,null,0,null,"","","",""]
[null,null,null,null,null,null,null,null,0,null,"","","",""]
[null,null,null,null,null,null,null,null,0,null,"","","",""]
[null,null,null,null,null,null,null,null,0,null,"","","",""]
[null,null,null,null,null,null,null,null,0,null,"","","",""]
[null,null,null,null,null,null,null,null,0,null,"","","",""]
[null,null,null,null,null,null,null,null,0,null,"","","",""]
[null,null,null,null,null,null,null,null,0,null,"","","",""]
[null,null,null,null,null,null,null,null,0,null,"","","",""]
[null,null,null,null,null,null,null,null,0,null,"","","",""]
[null,null,null,null,null,null,null,null,0,null,"","","",""]
[null,null,null,null,null,null,null,null,0,null,"","","",""]
[null,null,null,null,null,null,null,null,0,null,"","","",""]
[null,null,null,null,null,null,null,null,0,null,"","","",""]
[null,null,null,null,null,null,null,null,0,null,"","","",""]
[null,null,null,null,null,null,null,null,0,null,{"$f":"IFERROR(IF(J1447<>\"\",F1447*J1447,\"\"),\"\")","v":""},{"$f":"IFERROR(IF(J1447<>\"\",G1447*J1447,\"\"),\"\")","v":""},{"$f":"IFERROR(IF(J1447<>\"\",H1447*J1447,\"\"),\"\")","v":""},{"$f":"IFERROR(L1447+M1447,\"\")","v":""}]
[null,null,null,null,null,null,null,null,0,null,"","","",""]
[null,null,null,null,null,null,null,null,0,null,"","","",""]
[null,null,null,null,null,null,null,null,0,null,"","","",""]
[null,null,null,null,null,null,null,null,0,null,"","","",""]
[null,null,null,null,null,null,null,null,0,null,"","","",""]
[null,null,null,null,null,null,null,null,0,null,"","","",""]
[null,null,null,null,null,null,null,null,0,null,"","","",""]
[null,null,null,null,null,null,null,null,0,null,"","","",""]
[null,null,null,null,null,null,null,null,0,null,"","","",""]
[null,null,null,null,null,null,null,null,0,null,"","","",""]
[null,null,null,null,null,null,null,null,0,null,"","","",""]
[null,null,null,null,null,null,null,null,0,null,"","","",""]
[null,null,null,null,null,null,null,null,0,null,"","","",""]
[null,null,null,null,null,null,null,null,0,null,"","","",""]
[null,null,null,null,null,null,null,null,0,null,"","","",""]
[null,null,null,null,null,null,null,null,0,null,"","","",""]
[null,null,null,null,null,null,null,null,0,null,"","","",""]
[null,null,null,null,null,null,null,null,0,null,"","","",""]
[null,null,null,null,null,null,null,null,0,null,"","","",""]
[null,null,null,null,null,null,null,null,0,null,"","","",""]
[null,null,null,null,null,null,null,null,0,null,"","","",""]
[null,null,null,null,null,null,null,null,0,null,"","","",""]
[null,null,null,null,null,null,null,null,0,null,"","","",""]
[null,null,null,null,null,null,null,null,0,null,"","","",""]
[null,null,null,null,null,null,null,null,0,null,"","","",""]
[null,null,null,null,null,null,null,null,0,null,"","","",""]
[null,null,null,null,null,null,null,null,0,null,"","","",""]
[null,null,null,null,null,null,null,null,0,null,"","","",""]
[null,null,null,null,null,null,null,null,0,null,"","","",""]
[null,null,null,null,null,null,null,null,0,null,"","","",""]
[null,null,null,null,null,null,null,null,0,null,"","","",""]
[null,null,null,null,null,null,null,null,0,null,"","","",""]
[null,null,null,null,null,null,null,null,0,null,"","","",""]
[null,null,null,null,null,null,null,null,0,null,"","","",""]
[null,null,null,null,null,null,null,null,{"$f":"IFERROR(G1482+H1482,\"\")","v":0},null,"","","",""]
[null,null,null,null,null,null,null,null,0,null,"","","",""]
[null,null,null,null,null,null,null,null,0,null,"","","",""]
[null,null,null,null,null,null,null,null,0,null,"","","",""]
[null,null,null,null,null,null,null,null,0,null,"","","",""]
[null,null,null,null,null,null,null,null,0,null,"","","",""]
[null,null,null,null,null,null,null,null,0,null,"","","",""]
[null,null,null,null,null,null,null,null,0,null,"","","",""]
[null,null,null,null,null,null,null,null,0,null,"","","",""]
[null,null,null,null,null,null,null,null,0,null,"","","",""]
[null,null,null,null,null,null,null,null,0,null,"","","",""]
[null,null,null,null,null,null,null,null,0,null,"","","",""]
[null,null,null,null,null,null,null,null,0,null,"","","",""]
[null,null,null,null,null,null,null,null,0,null,"","","",""]
[null,null,null,null,null,null,null,null,0,null,"","","",""]
[null,null,null,null,null,null,null,null,0,null,"","","",""]
[null,null,null,null,null,null,null,null,0,null,"","","",""]
[null,null,null,null,null,null,null,null,0,null,"","","",""]
[null,null,null,null,null,null,null,null,0,null,"","","",""]
[null,null,null,null,null,null,null,null,0,null,"","","",""]
[null,null,null,null,null,null,null,null,0,null,"","","",""]
[null,null,null,null,null,null,null,null,0,null,"","","",""]
[null,null,null,null,null,null,null,null,0,null,"","","",""]
[null,null,null,null,null,null,null,null,0,null,"","","",""]
[null,null,null,null,null,null,null,null,0,null,"","","",""]
[null,null,null,null,null,null,null,null,0,null,"","","",""]
[null,null,null,null,null,null,null,null,0,null,"","","",""]
[null,null,null,null,null,null,null,null,0,null,"","","",""]
[null,null,null,null,null,null,null,null,0,null,"","","",""]
[null,null,null,null,null,null,null,null,0,null,{"$f":"IFERROR(IF(J1511<>\"\",F1511*J1511,\"\"),\"\")","v":""},{"$f":"IFERROR(IF(J1511<>\"\",G1511*J1511,\"\"),\"\")","v":""},{"$f":"IFERROR(IF(J1511<>\"\",H1511*J1511,\"\"),\"\")","v":""},{"$f":"IFERROR(L1511+M1511,\"\")","v":""}]
[null,null,null,null,null,null,null,null,0,null,"","","",""]
[null,null,null,null,null,null,null,null,0,null,"","","",""]
[null,null,null,null,null,null,null,null,0,null,"","","",""]
[null,null,null,null,null,null,null,null,0,null,"","","",""]
[null,null,null,null,null,null,null,null,0,null,"","","",""]
[null,null,null,null,null,null,null,null,0,null,"","","",""]
[null,null,null,null,null,null,null,null,0,null,"","","",""]
[null,null,null,null,null,null,null,null,0,null,"","","",""]
[null,null,null,null,null,null,null,null,0,null,"","","",""]
[null,null,null,null,null,null,null,null,0,null,"","","",""]
[null,null,null,null,null,null,null,null,0,null,"","","",""]
[null,null,null,null,null,null,null,null,0,null,"","","",""]
[null,null,null,null,null,null,null,null,0,null,"","","",""]
[null,null,null,null,null,null,null,null,0,null,"","","",""]
[null,null,null,null,null,null,null,null,0,null,"","","",""]
[null,null,null,null,null,null,null,null,0,null,"","","",""]
[null,null,null,null,null,null,null,null,0,null,"","","",""]
[null,null,null,null,null,null,null,null,0,null,"","","",""]
[null,null,null,null,null,null,null,null,0,null,"","","",""]
[null,null,null,null,null,null,null,null,0,null,"","","",""]
[null,null,null,null,null,null,null,null,0,null,"","","",""]
[null,null,null,null,null,null,null,null,0,null,"","","",""]
[null,null,null,null,null,null,null,null,0,null,"","","",""]
[null,null,null,null,null,null,null,null,0,null,"","","",""]
[null,null,null,null,null,null,null,null,0,null,"","","",""]
[null,null,null,null,null,null,null,null,0,null,"","","",""]
[null,null,null,null,null,null,null,null,0,null,"","","",""]
[null,null,null,null,null,null,null,null,0,null,"","","",""]
[null,null,null,null,null,null,null,null,0,null,"","","",""]
[null,null,null,null,null,null,null,null,0,null,"","","",""]
[null,null,null,null,null,null,null,null,0,null,"","","",""]
[null,null,null,null,null,null,null,null,0,null,"","","",""]
[null,null,null,null,null,null,null,null,0,null,"","","",""]
[null,null,null,null,null,null,null,null,0,null,"","","",""]
[null,null,null,null,null,null,null,null,{"$f":"IFERROR(G1546+H1546,\"\")","v":0},null,"","","",""]
[null,null,null,null,null,null,null,null,0,null,"","","",""]
[null,null,null,null,null,null,null,null,0,null,"","","",""]
[null,null,null,null,null,null,null,null,0,null,"","","",""]
[null,null,null,null,null,null,null,null,0,null,"","","",""]
[null,null,null,null,null,null,null,null,0,null,"","","",""]
[null,null,null,null,null,null,null,null,0,null,"","","",""]
[null,null,null,null,null,null,null,null,0,null,"","","",""]
[null,null,null,null,null,null,null,null,0,null,"","","",""]
[null,null,null,null,null,null,null,null,0,null,"","","",""]
[null,null,null,null,null,null,null,null,0,null,"","","",""]
[null,null,null,null,null,null,null,null,0,null,"","","",""]
[null,null,null,null,null,null,null,null,0,null,"","","",""]
[null,null,null,null,null,null,null,null,0,null,"","","",""]
[null,null,null,null,null,null,null,null,0,null,"","","",""]
[null,null,null,null,null,null,null,null,0,null,"","","",""]
[null,null,null,null,null,null,null,null,0,null,"","","",""]
[null,null,null,null,null,null,null,null,0,null,"","","",""]
[null,null,null,null,null,null,null,null,0,null,"","","",""]
[null,null,null,null,null,null,null,null,0,null,"","","",""]
[null,null,null,null,null,null,null,null,0,null,"","","",""]
[null,null,null,null,null,null,null,null,0,null,"","","",""]
[null,null,null,null,null,null,null,null,0,null,"","","",""]
[null,null,null,null,null,null,null,null,0,null,"","","",""]
[null,null,null,null,null,null,null,null,0,null,"","","",""]
[null,null,null,null,null,null,null,null,0,null,"","","",""]
[null,null,null,null,null,null,null,null,0,null,"","","",""]
[null,null,null,null,null,null,null,null,0,null,"","","",""]
[null,null,null,null,null,null,null,null,0,null,"","","",""]
[null,null,null,null,null,null,null,null,0,null,{"$f":"IFERROR(IF(J1575<>\"\",F1575*J1575,\"\"),\"\")","v":""},{"$f":"IFERROR(IF(J1575<>\"\",G1575*J1575,\"\"),\"\")","v":""},{"$f":"IFERROR(IF(J1575<>\"\",H1575*J1575,\"\"),\"\")","v":""},{"$f":"IFERROR(L1575+M1575,\"\")","v":""}]
[null,null,null,null,null,null,null,null,0,null,"","","",""]
[null,null,null,null,null,null,null,null,0,null,"","","",""]
[null,null,null,null,null,null,null,null,0,null,"","","",""]
[null,null,null,null,null,null,null,null,0,null,"","","",""]
[null,null,null,null,null,null,null,null,0,null,"","","",""]
[null,null,null,null,null,null,null,null,0,null,"","","",""]
[null,null,null,null,null,null,null,null,0,null,"","","",""]
[null,null,null,null,null,null,null,null,0,null,"","","",""]
[null,null,null,null,null,null,null,null,0,null,"","","",""]
[null,null,null,null,null,null,null,null,0,null,"","","",""]
[null,null,null,null,null,null,null,null,0,null,"","","",""]
[null,null,null,null,null,null,null,null,0,null,"","","",""]
[null,null,null,null,null,null,null,null,0,null,"","","",""]
[null,null,null,null,null,null,null,null,0,null,"","","",""]
[null,null,null,null,null,null,null,null,0,null,"","","",""]
[null,null,null,null,null,null,null,null,0,null,"","","",""]
[null,null,null,null,null,null,null,null,0,null,"","","",""]
[null,null,null,null,null,null,null,null,0,null,"","","",""]
[null,null,null,null,null,null,null,null,0,null,"","","",""]
[null,null,null,null,null,null,null,null,0,null,"","","",""]
[null,null,null,null,null,null,null,null,0,null,"","","",""]
[null,null,null,null,null,null,null,null,0,null,"","","",""]
[null,null,null,null,null,null,null,null,0,null,"","","",""]
[null,null,null,null,null,null,null,null,0,null,"","","",""]
[null,null,null,null,null,null,null,null,0,null,"","","",""]
[null,null,null,null,null,null,null,null,0,null,"","","",""]
[null,null,null,null,null,null,null,null,0,null,"","","",""]
[null,null,null,null,null,null,null,null,0,null,"","","",""]
[null,null,null,null,null,null,null,null,0,null,"","","",""]
[null,null,null,null,null,null,null,null,0,null,"","","",""]
[null,null,null,null,null,null,null,null,0,null,"","","",""]
[null,null,null,null,null,null,null,null,0,null,"","","",""]
[null,null,null,null,null,null,null,null,0,null,"","","",""]
[null,null,null,null,null,null,null,null,0,null,"","","",""]
[null,null,null,null,null,null,null,null,{"$f":"IFERROR(G1610+H1610,\"\")","v":0},null,"","","",""]
[null,null,null,null,null,null,null,null,0,null,"","","",""]
[null,null,null,null,null,null,null,null,0,null,"","","",""]
[null,null,null,null,null,null,null,null,0,null,"","","",""]
[null,null,null,null,null,null,null,null,0,null,"","","",""]
[null,null,null,null,null,null,null,null,0,null,"","","",""]
[null,null,null,null,null,null,null,null,0,null,"","","",""]
[null,null,null,null,null,null,null,null,0,null,"","","",""]
[null,null,null,null,null,null,null,null,0,null,"","","",""]
[null,null,null,null,null,null,null,null,0,null,"","","",""]
[null,null,null,null,null,null,null,null,0,null,"","","",""]
[null,null,null,null,null,null,null,null,0,null,"","","",""]
[null,null,null,null,null,null,null,null,0,null,"","","",""]
[null,null,null,null,null,null,null,null,0,null,"","","",""]
[null,null,null,null,null,null,null,null,0,null,"","","",""]
[null,null,null,null,null,null,null,null,0,null,"","","",""]
[null,null,null,null,null,null,null,null,0,null,"","","",""]
[null,null,null,null,null,null,null,null,0,null,"","","",""]
[null,null,null,null,null,null,null,null,0,null,"","","",""]
[null,null,null,null,null,null,null,null,0,null,"","","",""]
[null,null,null,null,null,null,null,null,0,null,"","","",""]
[null,null,null,null,null,null,null,null,0,null,"","","",""]
[null,null,null,null,null,null,null,null,0,null,"","","",""]
[null,null,null,null,null,null,null,null,0,null,"","","",""]
[null,null,null,null,null,null,null,null,0,null,"","","",""]
[null,null,null,null,null,null,null,null,0,null,"","","",""]
[null,null,null,null,null,null,null,null,0,null,"","","",""]
[null,null,null,null,null,null,null,null,0,null,"","","",""]
[null,null,null,null,null,null,null,null,0,null,"","","",""]
[null,null,null,null,null,null,null,null,0,null,{"$f":"IFERROR(IF(J1639<>\"\",F1639*J1639,\"\"),\"\")","v":""},{"$f":"IFERROR(IF(J1639<>\"\",G1639*J1639,\"\"),\"\")","v":""},{"$f":"IFERROR(IF(J1639<>\"\",H1639*J1639,\"\"),\"\")","v":""},{"$f":"IFERROR(L1639+M1639,\"\")","v":""}]
[null,null,null,null,null,null,null,null,0,null,"","","",""]
[null,null,null,null,null,null,null,null,0,null,"","","",""]
[null,null,null,null,null,null,null,null,0,null,"","","",""]
[null,null,null,null,null,null,null,null,0,null,"","","",""]
[null,null,null,null,null,null,null,null,0,null,"","","",""]
[null,null,null,null,null,null,null,null,0,null,"","","",""]
[null,null,null,null,null,null,null,null,0,null,"","","",""]
[null,null,null,null,null,null,null,null,0,null,"","","",""]
[null,null,null,null,null,null,null,null,0,null,"","","",""]
[null,null,null,null,null,null,null,null,0,null,"","","",""]
[null,null,null,null,null,null,null,null,0,null,"","","",""]
[null,null,null,null,null,null,null,null,0,null,"","","",""]
[null,null,null,null,null,null,null,null,0,null,"","","",""]
[null,null,null,null,null,null,null,null,0,null,"","","",""]
[null,null,null,null,null,null,null,null,0,null,"","","",""]
[null,null,null,null,null,null,null,null,0,null,"","","",""]
[null,null,null,null,null,null,null,null,0,null,"","","",""]
[null,null,null,null,null,null,null,null,0,null,"","","",""]
[null,null,null,null,null,null,null,null,0,null,"","","",""]
[null,null,null,null,null,null,null,null,0,null,"","","",""]
[null,null,null,null,null,null,null,null,0,null,"","","",""]
[null,null,null,null,null,null,null,null,0,null,"","","",""]
[null,null,null,null,null,null,null,null,0,null,"","","",""]
[null,null,null,null,null,null,null,null,0,null,"","","",""]
[null,null,null,null,null,null,null,null,0,null,"","","",""]
[null,null,null,null,null,null,null,null,0,null,"","","",""]
[null,null,null,null,null,null,null,null,0,null,"","","",""]
[null,null,null,null,null,null,null,null,0,null,"","","",""]
[null,null,null,null,null,null,null,null,0,null,"","","",""]
[null,null,null,null,null,null,null,null,0,null,"","","",""]
[null,null,null,null,null,null,null,null,0,null,"","","",""]
[null,null,null,null,null,null,null,null,0,null,"","","",""]
[null,null,null,null,null,null,null,null,0,null,"","","",""]
[null,null,null,null,null,null,null,null,0,null,"","","",""]
[null,null,null,null,null,null,null,null,{"$f":"IFERROR(G1674+H1674,\"\")","v":0},null,"","","",""]
[null,null,null,null,null,null,null,null,0,null,"","","",""]
[null,null,null,null,null,null,null,null,0,null,"","","",""]
[null,null,null,null,null,null,null,null,0,null,"","","",""]
[null,null,null,null,null,null,null,null,0,null,"","","",""]
[null,null,null,null,null,null,null,null,0,null,"","","",""]
[null,null,null,null,null,null,null,null,0,null,"","","",""]
[null,null,null,null,null,null,null,null,0,null,"","","",""]
[null,null,null,null,null,null,null,null,0,null,"","","",""]
[null,null,null,null,null,null,null,null,0,null,"","","",""]
[null,null,null,null,null,null,null,null,0,null,"","","",""]
[null,null,null,null,null,null,null,null,0,null,"","","",""]
[null,null,null,null,null,null,null,null,0,null,"","","",""]
[null,null,null,null,null,null,null,null,0,null,"","","",""]
[null,null,null,null,null,null,null,null,0,null,"","","",""]
[null,null,null,null,null,null,null,null,0,null,"","","",""]
[null,null,null,null,null,null,null,null,0,null,"","","",""]
[null,null,null,null,null,null,null,null,0,null,"","","",""]
[null,null,null,null,null,null,null,null,0,null,"","","",""]
[null,null,null,null,null,null,null,null,0,null,"","","",""]
[null,null,null,null,null,null,null,null,0,null,"","","",""]
[null,null,null,null,null,null,null,null,0,null,"","","",""]
[null,null,null,null,null,null,null,null,0,null,"","","",""]
[null,null,null,null,null,null,null,null,0,null,"","","",""]
[null,null,null,null,null,null,null,null,0,null,"","","",""]
[null,null,null,null,null,null,null,null,0,null,"","","",""]
[null,null,null,null,null,null,null,null,0,null,"","","",""]
[null,null,null,null,null,null,null,null,0,null,"","","",""]
[null,null,null,null,null,null,null,null,0,null,"","","",""]
[null,null,null,null,null,null,null,null,0,null,{"$f":"IFERROR(IF(J1703<>\"\",F1703*J1703,\"\"),\"\")","v":""},{"$f":"IFERROR(IF(J1703<>\"\",G1703*J1703,\"\"),\"\")","v":""},{"$f":"IFERROR(IF(J1703<>\"\",H1703*J1703,\"\"),\"\")","v":""},{"$f":"IFERROR(L1703+M1703,\"\")","v":""}]
[null,null,null,null,null,null,null,null,0,null,"","","",""]
[null,null,null,null,null,null,null,null,0,null,"","","",""]
[null,null,null,null,null,null,null,null,0,null,"","","",""]
[null,null,null,null,null,null,null,null,0,null,"","","",""]
[null,null,null,null,null,null,null,null,0,null,"","","",""]
[null,null,null,null,null,null,null,null,0,null,"","","",""]
[null,null,null,null,null,null,null,null,0,null,"","","",""]
[null,null,null,null,null,null,null,null,0,null,"","","",""]
[null,null,null,null,null,null,null,null,0,null,"","","",""]
[null,null,null,null,null,null,null,null,0,null,"","","",""]
[null,null,null,null,null,null,null,null,0,null,"","","",""]
[null,null,null,null,null,null,null,null,0,null,"","","",""]
[null,null,null,null,null,null,null,null,0,null,"","","",""]
[null,null,null,null,null,null,null,null,0,null,"","","",""]
[null,null,null,null,null,null,null,null,0,null,"","","",""]
[null,null,null,null,null,null,null,null,0,null,"","","",""]
[null,null,null,null,null,null,null,null,0,null,"","","",""]
[null,null,null,null,null,null,null,null,0,null,"","","",""]
[null,null,null,null,null,null,null,null,0,null,"","","",""]
[null,null,null,null,null,null,null,null,0,null,"","","",""]
[null,null,null,null,null,null,null,null,0,null,"","","",""]
[null,null,null,null,null,null,null,null,0,null,"","","",""]
[null,null,null,null,null,null,null,null,0,null,"","","",""]
[null,null,null,null,null,null,null,null,0,null,"","","",""]
[null,null,null,null,null,null,null,null,0,null,"","","",""]
[null,null,null,null,null,null,null,null,0,null,"","","",""]
[null,null,null,null,null,null,null,null,0,null,"","","",""]
[null,null,null,null,null,null,null,null,0,null,"","","",""]
[null,null,null,null,null,null,null,null,0,null,"","","",""]
[null,null,null,null,null,null,null,null,0,null,"","","",""]
[null,null,null,null,null,null,null,null,0,null,"","","",""]
[null,null,null,null,null,null,null,null,0,null,"","","",""]
[null,null,null,null,null,null,null,null,0,null,"","","",""]
[null,null,null,null,null,null,null,null,0,null,"","","",""]
[null,null,null,null,null,null,null,null,{"$f":"IFERROR(G1738+H1738,\"\")","v":0},null,"","","",""]
[null,null,null,null,null,null,null,null,0,null,"","","",""]
[null,null,null,null,null,null,null,null,0,null,"","","",""]
[null,null,null,null,null,null,null,null,0,null,"","","",""]
[null,null,null,null,null,null,null,null,0,null,"","","",""]
[null,null,null,null,null,null,null,null,0,null,"","","",""]
[null,null,null,null,null,null,null,null,0,null,"","","",""]
[null,null,null,null,null,null,null,null,0,null,"","","",""]
[null,null,null,null,null,null,null,null,0,null,"","","",""]
[null,null,null,null,null,null,null,null,0,null,"","","",""]
[null,null,null,null,null,null,null,null,0,null,"","","",""]
[null,null,null,null,null,null,null,null,0,null,"","","",""]
[null,null,null,null,null,null,null,null,0,null,"","","",""]
[null,null,null,null,null,null,null,null,0,null,"","","",""]
[null,null,null,null,null,null,null,null,0,null,"","","",""]
[null,null,null,null,null,null,null,null,0,null,"","","",""]
[null,null,null,null,null,null,null,null,0,null,"","","",""]
[null,null,null,null,null,null,null,null,0,null,"","","",""]
[null,null,null,null,null,null,null,null,0,null,"","","",""]
[null,null,null,null,null,null,null,null,0,null,"","","",""]
[null,null,null,null,null,null,null,null,0,null,"","","",""]
[null,null,null,null,null,null,null,null,0,null,"","","",""]
[null,null,null,null,null,null,null,null,0,null,"","","",""]
[null,null,null,null,null,null,null,null,0,null,"","","",""]
[null,null,null,null,null,null,null,null,0,null,"","","",""]
[null,null,null,null,null,null,null,null,0,null,"","","",""]
[null,null,null,null,null,null,null,null,0,null,"","","",""]
[null,null,null,null,null,null,null,null,0,null,"","","",""]
[null,null,null,null,null,null,null,null,0,null,"","","",""]
[null,null,null,null,null,null,null,null,0,null,{"$f":"IFERROR(IF(J1767<>\"\",F1767*J1767,\"\"),\"\")","v":""},{"$f":"IFERROR(IF(J1767<>\"\",G1767*J1767,\"\"),\"\")","v":""},{"$f":"IFERROR(IF(J1767<>\"\",H1767*J1767,\"\"),\"\")","v":""},{"$f":"IFERROR(L1767+M1767,\"\")","v":""}]
[null,null,null,null,null,null,null,null,0,null,"","","",""]
[null,null,null,null,null,null,null,null,0,null,"","","",""]
[null,null,null,null,null,null,null,null,0,null,"","","",""]
[null,null,null,null,null,null,null,null,0,null,"","","",""]
[null,null,null,null,null,null,null,null,0,null,"","","",""]
[null,null,null,null,null,null,null,null,0,null,"","","",""]
[null,null,null,null,null,null,null,null,0,null,"","","",""]
[null,null,null,null,null,null,null,null,0,null,"","","",""]
[null,null,null,null,null,null,null,null,0,null,"","","",""]
[null,null,null,null,null,null,null,null,0,null,"","","",""]
[null,null,null,null,null,null,null,null,0,null,"","","",""]
[null,null,null,null,null,null,null,null,0,null,"","","",""]
[null,null,null,null,null,null,null,null,0,null,"","","",""]
[null,null,null,null,null,null,null,null,0,null,"","","",""]
[null,null,null,null,null,null,null,null,0,null,"","","",""]
[null,null,null,null,null,null,null,null,0,null,"","","",""]
[null,null,null,null,null,null,null,null,0,null,"","","",""]
[null,null,null,null,null,null,null,null,0,null,"","","",""]
[null,null,null,null,null,null,null,null,0,null,"","","",""]
[null,null,null,null,null,null,null,null,0,null,"","","",""]
[null,null,null,null,null,null,null,null,0,null,"","","",""]
[null,null,null,null,null,null,null,null,0,null,"","","",""]
[null,null,null,null,null,null,null,null,0,null,"","","",""]
[null,null,null,null,null,null,null,null,0,null,"","","",""]
[null,null,null,null,null,null,null,null,0,null,"","","",""]
[null,null,null,null,null,null,null,null,0,null,"","","",""]
[null,null,null,null,null,null,null,null,0,null,"","","",""]
[null,null,null,null,null,null,null,null,0,null,"","","",""]
[null,null,null,null,null,null,null,null,0,null,"","","",""]
[null,null,null,null,null,null,null,null,0,null,"","","",""]
[null,null,null,null,null,null,null,null,0,null,"","","",""]
[null,null,null,null,null,null,null,null,0,null,"","","",""]
[null,null,null,null,null,null,null,null,0,null,"","","",""]
[null,null,null,null,null,null,null,null,0,null,"","","",""]
[null,null,null,null,null,null,null,null,{"$f":"IFERROR(G1802+H1802,\"\")","v":0},null,"","","",""]
[null,null,null,null,null,null,null,null,0,null,"","","",""]
[null,null,null,null,null,null,null,null,0,null,"","","",""]
[null,null,null,null,null,null,null,null,0,null,"","","",""]
[null,null,null,null,null,null,null,null,0,null,"","","",""]
[null,null,null,null,null,null,null,null,0,null,"","","",""]
[null,null,null,null,null,null,null,null,0,null,"","","",""]
[null,null,null,null,null,null,null,null,0,null,"","","",""]
[null,null,null,null,null,null,null,null,0,null,"","","",""]
[null,null,null,null,null,null,null,null,0,null,"","","",""]
[null,null,null,null,null,null,null,null,0,null,"","","",""]
[null,null,null,null,null,null,null,null,0,null,"","","",""]
[null,null,null,null,null,null,null,null,0,null,"","","",""]
[null,null,null,null,null,null,null,null,0,null,"","","",""]
[null,null,null,null,null,null,null,null,0,null,"","","",""]
[null,null,null,null,null,null,null,null,0,null,"","","",""]
[null,null,null,null,null,null,null,null,0,null,"","","",""]
[null,null,null,null,null,null,null,null,0,null,"","","",""]
[null,null,null,null,null,null,null,null,0,null,"","","",""]
[null,null,null,null,null,null,null,null,0,null,"","","",""]
[null,null,null,null,null,null,null,null,0,null,"","","",""]
[null,null,null,null,null,null,null,null,0,null,"","","",""]
[null,null,null,null,null,null,null,null,0,null,"","","",""]
[null,null,null,null,null,null,null,null,0,null,"","","",""]
[null,null,null,null,null,null,null,null,0,null,"","","",""]
[null,null,null,null,null,null,null,null,0,null,"","","",""]
[null,null,null,null,null,null,null,null,0,null,"","","",""]
[null,null,null,null,null,null,null,null,0,null,"","","",""]
[null,null,null,null,null,null,null,null,0,null,"","","",""]
[null,null,null,null,null,null,null,null,0,null,{"$f":"IFERROR(IF(J1831<>\"\",F1831*J1831,\"\"),\"\")","v":""},{"$f":"IFERROR(IF(J1831<>\"\",G1831*J1831,\"\"),\"\")","v":""},{"$f":"IFERROR(IF(J1831<>\"\",H1831*J1831,\"\"),\"\")","v":""},{"$f":"IFERROR(L1831+M1831,\"\")","v":""}]
[null,null,null,null,null,null,null,null,0,null,"","","",""]
[null,null,null,null,null,null,null,null,0,null,"","","",""]
[null,null,null,null,null,null,null,null,0,null,"","","",""]
[null,null,null,null,null,null,null,null,0,null,"","","",""]
[null,null,null,null,null,null,null,null,0,null,"","","",""]
[null,null,null,null,null,null,null,null,0,null,"","","",""]
[null,null,null,null,null,null,null,null,0,null,"","","",""]
[null,null,null,null,null,null,null,null,0,null,"","","",""]
[null,null,null,null,null,null,null,null,0,null,"","","",""]
[null,null,null,null,null,null,null,null,0,null,"","","",""]
[null,null,null,null,null,null,null,null,0,null,"","","",""]
[null,null,null,null,null,null,null,null,0,null,"","","",""]
[null,null,null,null,null,null,null,null,0,null,"","","",""]
[null,null,null,null,null,null,null,null,0,null,"","","",""]
[null,null,null,null,null,null,null,null,0,null,"","","",""]
[null,null,null,null,null,null,null,null,0,null,"","","",""]
[null,null,null,null,null,null,null,null,0,null,"","","",""]
[null,null,null,null,null,null,null,null,0,null,"","","",""]
[null,null,null,null,null,null,null,null,0,null,"","","",""]
[null,null,null,null,null,null,null,null,0,null,"","","",""]
[null,null,null,null,null,null,null,null,0,null,"","","",""]
[null,null,null,null,null,null,null,null,0,null,"","","",""]
[null,null,null,null,null,null,null,null,0,null,"","","",""]
[null,null,null,null,null,null,null,null,0,null,"","","",""]
[null,null,null,null,null,null,null,null,0,null,"","","",""]
[null,null,null,null,null,null,null,null,0,null,"","","",""]
[null,null,null,null,null,null,null,null,0,null,"","","",""]
[null,null,null,null,null,null,null,null,0,null,"","","",""]
[null,null,null,null,null,null,null,null,0,null,"","","",""]
[null,null,null,null,null,null,null,null,0,null,"","","",""]
[null,null,null,null,null,null,null,null,0,null,"","","",""]
[null,null,null,null,null,null,null,null,0,null,"","","",""]
[null,null,null,null,null,null,null,null,0,null,"","","",""]
[null,null,null,null,null,null,null,null,0,null,"","","",""]
[null,null,null,null,null,null,null,null,{"$f":"IFERROR(G1866+H1866,\"\")","v":0},null,"","","",""]
[null,null,null,null,null,null,null,null,0,null,"","","",""]
[null,null,null,null,null,null,null,null,0,null,"","","",""]
[null,null,null,null,null,null,null,null,0,null,"","","",""]
[null,null,null,null,null,null,null,null,0,null,"","","",""]
[null,null,null,null,null,null,null,null,0,null,"","","",""]
[null,null,null,null,null,null,null,null,0,null,"","","",""]
[null,null,null,null,null,null,null,null,0,null,"","","",""]
[null,null,null,null,null,null,null,null,0,null,"","","",""]
[null,null,null,null,null,null,null,null,0,null,"","","",""]
[null,null,null,null,null,null,null,null,0,null,"","","",""]
[null,null,null,null,null,null,null,null,0,null,"","","",""]
[null,null,null,null,null,null,null,null,0,null,"","","",""]
[null,null,null,null,null,null,null,null,0,null,"","","",""]
[null,null,null,null,null,null,null,null,0,null,"","","",""]
[null,null,null,null,null,null,null,null,0,null,"","","",""]
[null,null,null,null,null,null,null,null,0,null,"","","",""]
[null,null,null,null,null,null,null,null,0,null,"","","",""]
[null,null,null,null,null,null,null,null,0,null,"","","",""]
[null,null,null,null,null,null,null,null,0,null,"","","",""]
[null,null,null,null,null,null,null,null,0,null,"","","",""]
[null,null,null,null,null,null,null,null,0,null,"","","",""]
[null,null,null,null,null,null,null,null,0,null,"","","",""]
[null,null,null,null,null,null,null,null,0,null,"","","",""]
[null,null,null,null,null,null,null,null,0,null,"","","",""]
[null,null,null,null,null,null,null,null,0,null,"","","",""]
[null,null,null,null,null,null,null,null,0,null,"","","",""]
[null,null,null,null,null,null,null,null,0,null,"","","",""]
[null,null,null,null,null,null,null,null,0,null,"","","",""]
[null,null,null,null,null,null,null,null,0,null,{"$f":"IFERROR(IF(J1895<>\"\",F1895*J1895,\"\"),\"\")","v":""},{"$f":"IFERROR(IF(J1895<>\"\",G1895*J1895,\"\"),\"\")","v":""},{"$f":"IFERROR(IF(J1895<>\"\",H1895*J1895,\"\"),\"\")","v":""},{"$f":"IFERROR(L1895+M1895,\"\")","v":""}]
[null,null,null,null,null,null,null,null,0,null,"","","",""]
[null,null,null,null,null,null,null,null,0,null,"","","",""]
[null,null,null,null,null,null,null,null,0,null,"","","",""]
[null,null,null,null,null,null,null,null,0,null,"","","",""]
[null,null,null,null,null,null,null,null,0,null,"","","",""]
[null,null,null,null,null,null,null,null,0,null,"","","",""]
[null,null,null,null,null,null,null,null,0,null,"","","",""]
[null,null,null,null,null,null,null,null,0,null,"","","",""]
[null,null,null,null,null,null,null,null,0,null,"","","",""]
[null,null,null,null,null,null,null,null,0,null,"","","",""]
[null,null,null,null,null,null,null,null,0,null,"","","",""]
[null,null,null,null,null,null,null,null,0,null,"","","",""]
[null,null,null,null,null,null,null,null,0,null,"","","",""]
[null,null,null,null,null,null,null,null,0,null,"","","",""]
[null,null,null,null,null,null,null,null,0,null,"","","",""]
[null,null,null,null,null,null,null,null,0,null,"","","",""]
[null,null,null,null,null,null,null,null,0,null,"","","",""]
[null,null,null,null,null,null,null,null,0,null,"","","",""]
[null,null,null,null,null,null,null,null,0,null,"","","",""]
[null,null,null,null,null,null,null,null,0,null,"","","",""]
[null,null,null,null,null,null,null,null,0,null,"","","",""]
[null,null,null,null,null,null,null,null,0,null,"","","",""]
[null,null,null,null,null,null,null,null,0,null,"","","",""]
[null,null,null,null,null,null,null,null,0,null,"","","",""]
[null,null,null,null,null,null,null,null,0,null,"","","",""]
[null,null,null,null,null,null,null,null,0,null,"","","",""]
[null,null,null,null,null,null,null,null,0,null,"","","",""]
[null,null,null,null,null,null,null,null,0,null,"","","",""]
[null,null,null,null,null,null,null,null,0,null,"","","",""]
[null,null,null,null,null,null,null,null,0,null,"","","",""]
[null,null,null,null,null,null,null,null,0,null,"","","",""]
[null,null,null,null,null,null,null,null,0,null,"","","",""]
[null,null,null,null,null,null,null,null,0,null,"","","",""]
[null,null,null,null,null,null,null,null,0,null,"","","",""]
[null,null,null,null,null,null,null,null,{"$f":"IFERROR(G1930+H1930,\"\")","v":0},null,"","","",""]
[null,null,null,null,null,null,null,null,0,null,"","","",""]
[null,null,null,null,null,null,null,null,0,null,"","","",""]
[null,null,null,null,null,null,null,null,0,null,"","","",""]
[null,null,null,null,null,null,null,null,0,null,"","","",""]
[null,null,null,null,null,null,null,null,0,null,"","","",""]
[null,null,null,null,null,null,null,null,0,null,"","","",""]
[null,null,null,null,null,null,null,null,0,null,"","","",""]
[null,null,null,null,null,null,null,null,0,null,"","","",""]
[null,null,null,null,null,null,null,null,0,null,"","","",""]
[null,null,null,null,null,null,null,null,0,null,"","","",""]
[null,null,null,null,null,null,null,null,0,null,"","","",""]
[null,null,null,null,null,null,null,null,0,null,"","","",""]
[null,null,null,null,null,null,null,null,0,null,"","","",""]
[null,null,null,null,null,null,null,null,0,null,"","","",""]
[null,null,null,null,null,null,null,null,0,null,"","","",""]
[null,null,null,null,null,null,null,null,0,null,"","","",""]
[null,null,null,null,null,null,null,null,0,null,"","","",""]
[null,null,null,null,null,null,null,null,0,null,"","","",""]
[null,null,null,null,null,null,null,null,0,null,"","","",""]
[null,null,null,null,null,null,null,null,0,null,"","","",""]
[null,null,null,null,null,null,null,null,0,null,"","","",""]
[null,null,null,null,null,null,null,null,0,null,"","","",""]
[null,null,null,null,null,null,null,null,0,null,"","","",""]
[null,null,null,null,null,null,null,null,0,null,"","","",""]
[null,null,null,null,null,null,null,null,0,null,"","","",""]
[null,null,null,null,null,null,null,null,0,null,"","","",""]
[null,null,null,null,null,null,null,null,0,null,"","","",""]
[null,null,null,null,null,null,null,null,0,null,"","","",""]
[null,null,null,null,null,null,null,null,0,null,{"$f":"IFERROR(IF(J1959<>\"\",F1959*J1959,\"\"),\"\")","v":""},{"$f":"IFERROR(IF(J1959<>\"\",G1959*J1959,\"\"),\"\")","v":""},{"$f":"IFERROR(IF(J1959<>\"\",H1959*J1959,\"\"),\"\")","v":""},{"$f":"IFERROR(L1959+M1959,\"\")","v":""}]
[null,null,null,null,null,null,null,null,0,null,"","","",""]
[null,null,null,null,null,null,null,null,0,null,"","","",""]
[null,null,null,null,null,null,null,null,0,null,"","","",""]
[null,null,null,null,null,null,null,null,0,null,"","","",""]
[null,null,null,null,null,null,null,null,0,null,"","","",""]
[null,null,null,null,null,null,null,null,0,null,"","","",""]
[null,null,null,null,null,null,null,null,0,null,"","","",""]
[null,null,null,null,null,null,null,null,0,null,"","","",""]
[null,null,null,null,null,null,null,null,0,null,"","","",""]
[null,null,null,null,null,null,null,null,0,null,"","","",""]
[null,null,null,null,null,null,null,null,0,null,"","","",""]
[null,null,null,null,null,null,null,null,0,null,"","","",""]
[null,null,null,null,null,null,null,null,0,null,"","","",""]
[null,null,null,null,null,null,null,null,0,null,"","","",""]
[null,null,null,null,null,null,null,null,0,null,"","","",""]
[null,null,null,null,null,null,null,null,0,null,"","","",""]
[null,null,null,null,null,null,null,null,0,null,"","","",""]
[null,null,null,null,null,null,null,null,0,null,"","","",""]
[null,null,null,null,null,null,null,null,0,null,"","","",""]
[null,null,null,null,null,null,null,null,0,null,"","","",""]
[null,null,null,null,null,null,null,null,0,null,"","","",""]
[null,null,null,null,null,null,null,null,0,null,"","","",""]
[null,null,null,null,null,null,null,null,0,null,"","","",""]
[null,null,null,null,null,null,null,null,0,null,"","","",""]
[null,null,null,null,null,null,null,null,0,null,"","","",""]
[null,null,null,null,null,null,null,null,0,null,"","","",""]
[null,null,null,null,null,null,null,null,0,null,"","","",""]
[null,null,null,null,null,null,null,null,0,null,"","","",""]
[null,null,null,null,null,null,null,null,0,null,"","","",""]
[null,null,null,null,null,null,null,null,0,null,"","","",""]
[null,null,null,null,null,null,null,null,0,null,"","","",""]
[null,null,null,null,null,null,null,null,0,null,"","","",""]
[null,null,null,null,null,null,null,null,0,null,"","","",""]
[null,null,null,null,null,null,null,null,0,null,"","","",""]
[null,null,null,null,null,null,null,null,{"$f":"IFERROR(G1994+H1994,\"\")","v":0},null,"","","",""]
[null,null,null,null,null,null,null,null,0,null,"","","",""]
[null,null,null,null,null,null,null,null,0,null,"","","",""]
[null,null,null,null,null,null,null,null,0,null,"","","",""]
[null,null,null,null,null,null,null,null,0,null,"","","",""]
[null,null,null,null,null,null,null,null,0,null,"","","",""]
[null,null,null,null,null,null,null,null,0,null,"","","",""]
[null,null,null,null,null,null,null,null,0,null,"","","",""]
[null,null,null,null,null,null,null,null,0,null,"","","",""]
[null,null,null,null,null,null,null,null,0,null,"","","",""]
[null,null,null,null,null,null,null,null,0,null,"","","",""]
[null,null,null,null,null,null,null,null,0,null,"","","",""]
[null,null,null,null,null,null,null,null,0,null,"","","",""]
[null,null,null,null,null,null,null,null,0,null,"","","",""]
[null,null,null,null,null,null,null,null,0,null,"","","",""]
[null,null,null,null,null,null,null,null,0,null,"","","",""]
[null,null,null,null,null,null,null,null,0,null,"","","",""]
[null,null,null,null,null,null,null,null,0,null,"","","",""]
[null,null,null,null,null,null,null,null,0,null,"","","",""]
[null,null,null,null,null,null,null,null,0,null,"","","",""]
[null,null,null,null,null,null,null,null,0,null,"","","",""]
[null,null,null,null,null,null,null,null,0,null,"","","",""]
[null,null,null,null,null,null,null,null,0,null,"","","",""]
[null,null,null,null,null,null,null,null,0,null,"","","",""]
[null,null,null,null,null,null,null,null,0,null,"","","",""]
[null,null,null,null,null,null,null,null,0,null,"","","",""]
[null,null,null,null,null,null,null,null,0,null,"","","",""]
[null,null,null,null,null,null,null,null,0,null,"","","",""]
[null,null,null,null,null,null,null,null,0,null,"","","",""]
[null,null,null,null,null,null,null,null,0,null,{"$f":"IFERROR(IF(J2023<>\"\",F2023*J2023,\"\"),\"\")","v":""},{"$f":"IFERROR(IF(J2023<>\"\",G2023*J2023,\"\"),\"\")","v":""},{"$f":"IFERROR(IF(J2023<>\"\",H2023*J2023,\"\"),\"\")","v":""},{"$f":"IFERROR(L2023+M2023,\"\")","v":""}]
[null,null,null,null,null,null,null,null,0,null,"","","",""]
[null,null,null,null,null,null,null,null,0,null,"","","",""]
[null,null,null,null,null,null,null,null,0,null,"","","",""]
[null,null,null,null,null,null,null,null,0,null,"","","",""]
[null,null,null,null,null,null,null,null,0,null,"","","",""]
[null,null,null,null,null,null,null,null,0,null,"","","",""]
[null,null,null,null,null,null,null,null,0,null,"","","",""]
[null,null,null,null,null,null,null,null,0,null,"","","",""]
[null,null,null,null,null,null,null,null,0,null,"","","",""]
[null,null,null,null,null,null,null,null,0,null,"","","",""]
[null,null,null,null,null,null,null,null,0,null,"","","",""]
[null,null,null,null,null,null,null,null,0,null,"","","",""]
[null,null,null,null,null,null,null,null,0,null,"","","",""]
[null,null,null,null,null,null,null,null,0,null,"","","",""]
[null,null,null,null,null,null,null,null,0,null,"","","",""]
[null,null,null,null,null,null,null,null,0,null,"","","",""]
[null,null,null,null,null,null,null,null,0,null,"","","",""]
[null,null,null,null,null,null,null,null,0,null,"","","",""]
[null,null,null,null,null,null,null,null,0,null,"","","",""]
[null,null,null,null,null,null,null,null,0,null,"","","",""]
[null,null,null,null,null,null,null,null,0,null,"","","",""]
[null,null,null,null,null,null,null,null,0,null,"","","",""]
[null,null,null,null,null,null,null,null,0,null,"","","",""]
[null,null,null,null,null,null,null,null,0,null,"","","",""]
[null,null,null,null,null,null,null,null,0,null,"","","",""]
[null,null,null,null,null,null,null,null,0,null,"","","",""]
[null,null,null,null,null,null,null,null,0,null,"","","",""]
[null,null,null,null,null,null,null,null,0,null,"","","",""]
[null,null,null,null,null,null,null,null,0,null,"","","",""]
[null,null,null,null,null,null,null,null,0,null,"","","",""]
[null,null,null,null,null,null,null,null,0,null,"","","",""]
[null,null,null,null,null,null,null,null,0,null,"","","",""]
[null,null,null,null,null,null,null,null,0,null,"","","",""]
[null,null,null,null,null,null,null,null,0,null,"","","",""]
[null,null,null,null,null,null,null,null,{"$f":"IFERROR(G2058+H2058,\"\")","v":0},null,"","","",""]
[null,null,null,null,null,null,null,null,0,null,"","","",""]
[null,null,null,null,null,null,null,null,0,null,"","","",""]
[null,null,null,null,null,null,null,null,0,null,"","","",""]
[null,null,null,null,null,null,null,null,0,null,"","","",""]
[null,null,null,null,null,null,null,null,0,null,"","","",""]
[null,null,null,null,null,null,null,null,0,null,"","","",""]
[null,null,null,null,null,null,null,null,0,null,"","","",""]
[null,null,null,null,null,null,null,null,0,null,"","","",""]
[null,null,null,null,null,null,null,null,0,null,"","","",""]
[null,null,null,null,null,null,null,null,0,null,"","","",""]
[null,null,null,null,null,null,null,null,0,null,"","","",""]
[null,null,null,null,null,null,null,null,0,null,"","","",""]
[null,null,null,null,null,null,null,null,0,null,"","","",""]
[null,null,null,null,null,null,null,null,0,null,"","","",""]
[null,null,null,null,null,null,null,null,0,null,"","","",""]
[null,null,null,null,null,null,null,null,0,null,"","","",""]
[null,null,null,null,null,null,null,null,0,null,"","","",""]
[null,null,null,null,null,null,null,null,0,null,"","","",""]
[null,null,null,null,null,null,null,null,0,null,"","","",""]
[null,null,null,null,null,null,null,null,0,null,"","","",""]
[null,null,null,null,null,null,null,null,0,null,"","","",""]
[null,null,null,null,null,null,null,null,0,null,"","","",""]
[null,null,null,null,null,null,null,null,0,null,"","","",""]
[null,null,null,null,null,null,null,null,0,null,"","","",""]
[null,null,null,null,null,null,null,null,0,null,"","","",""]
[null,null,null,null,null,null,null,null,0,null,"","","",""]
[null,null,null,null,null,null,null,null,0,null,"","","",""]
[null,null,null,null,null,null,null,null,0,null,"","","",""]
[null,null,null,null,null,null,null,null,0,null,{"$f":"IFERROR(IF(J2087<>\"\",F2087*J2087,\"\"),\"\")","v":""},{"$f":"IFERROR(IF(J2087<>\"\",G2087*J2087,\"\"),\"\")","v":""},{"$f":"IFERROR(IF(J2087<>\"\",H2087*J2087,\"\"),\"\")","v":""},{"$f":"IFERROR(L2087+M2087,\"\")","v":""}]
[null,null,null,null,null,null,null,null,0,null,"","","",""]
[null,null,null,null,null,null,null,null,0,null,"","","",""]
[null,null,null,null,null,null,null,null,0,null,"","","",""]
[null,null,null,null,null,null,null,null,0,null,"","","",""]
[null,null,null,null,null,null,null,null,0,null,"","","",""]
[null,null,null,null,null,null,null,null,0,null,"","","",""]
[null,null,null,null,null,null,null,null,0,null,"","","",""]
[null,null,null,null,null,null,null,null,0,null,"","","",""]
[null,null,null,null,null,null,null,null,0,null,"","","",""]
[null,null,null,null,null,null,null,null,0,null,"","","",""]
[null,null,null,null,null,null,null,null,0,null,"","","",""]
[null,null,null,null,null,null,null,null,0,null,"","","",""]
[null,null,null,null,null,null,null,null,0,null,"","","",""]
[null,null,null,null,null,null,null,null,0,null,"","","",""]
[null,null,null,null,null,null,null,null,0,null,"","","",""]
[null,null,null,null,null,null,null,null,0,null,"","","",""]
[null,null,null,null,null,null,null,null,0,null,"","","",""]
[null,null,null,null,null,null,null,null,0,null,"","","",""]
[null,null,null,null,null,null,null,null,0,null,"","","",""]
[null,null,null,null,null,null,null,null,0,null,"","","",""]
[null,null,null,null,null,null,null,null,0,null,"","","",""]
[null,null,null,null,null,null,null,null,0,null,"","","",""]
[null,null,null,null,null,null,null,null,0,null,"","","",""]
[null,null,null,null,null,null,null,null,0,null,"","","",""]
[null,null,null,null,null,null,null,null,0,null,"","","",""]
[null,null,null,null,null,null,null,null,0,null,"","","",""]
[null,null,null,null,null,null,null,null,0,null,"","","",""]
[null,null,null,null,null,null,null,null,0,null,"","","",""]
[null,null,null,null,null,null,null,null,0,null,"","","",""]
[null,null,null,null,null,null,null,null,0,null,"","","",""]
[null,null,null,null,null,null,null,null,0,null,"","","",""]
[null,null,null,null,null,null,null,null,0,null,"","","",""]
[null,null,null,null,null,null,null,null,0,null,"","","",""]
[null,null,null,null,null,null,null,null,0,null,"","","",""]
[null,null,null,null,null,null,null,null,{"$f":"IFERROR(G2122+H2122,\"\")","v":0},null,"","","",""]
[null,null,null,null,null,null,null,null,0,null,"","","",""]
[null,null,null,null,null,null,null,null,0,null,"","","",""]
[null,null,null,null,null,null,null,null,0,null,"","","",""]
[null,null,null,null,null,null,null,null,0,null,"","","",""]
[null,null,null,null,null,null,null,null,0,null,"","","",""]
[null,null,null,null,null,null,null,null,0,null,"","","",""]
[null,null,null,null,null,null,null,null,0,null,"","","",""]
[null,null,null,null,null,null,null,null,0,null,"","","",""]
[null,null,null,null,null,null,null,null,0,null,"","","",""]
[null,null,null,null,null,null,null,null,0,null,"","","",""]
[null,null,null,null,null,null,null,null,0,null,"","","",""]
[null,null,null,null,null,null,null,null,0,null,"","","",""]
[null,null,null,null,null,null,null,null,0,null,"","","",""]
[null,null,null,null,null,null,null,null,0,null,"","","",""]
[null,null,null,null,null,null,null,null,0,null,"","","",""]
[null,null,null,null,null,null,null,null,0,null,"","","",""]
[null,null,null,null,null,null,null,null,0,null,"","","",""]
[null,null,null,null,null,null,null,null,0,null,"","","",""]
[null,null,null,null,null,null,null,null,0,null,"","","",""]
[null,null,null,null,null,null,null,null,0,null,"","","",""]
[null,null,null,null,null,null,null,null,0,null,"","","",""]
[null,null,null,null,null,null,null,null,0,null,"","","",""]
[null,null,null,null,null,null,null,null,0,null,"","","",""]
[null,null,null,null,null,null,null,null,0,null,"","","",""]
[null,null,null,null,null,null,null,null,0,null,"","","",""]
[null,null,null,null,null,null,null,null,0,null,"","","",""]
[null,null,null,null,null,null,null,null,0,null,"","","",""]
[null,null,null,null,null,null,null,null,0,null,"","","",""]
[null,null,null,null,null,null,null,null,0,null,{"$f":"IFERROR(IF(J2151<>\"\",F2151*J2151,\"\"),\"\")","v":""},{"$f":"IFERROR(IF(J2151<>\"\",G2151*J2151,\"\"),\"\")","v":""},{"$f":"IFERROR(IF(J2151<>\"\",H2151*J2151,\"\"),\"\")","v":""},{"$f":"IFERROR(L2151+M2151,\"\")","v":""}]
[null,null,null,null,null,null,null,null,0,null,"","","",""]
[null,null,null,null,null,null,null,null,0,null,"","","",""]
[null,null,null,null,null,null,null,null,0,null,"","","",""]
[null,null,null,null,null,null,null,null,0,null,"","","",""]
[null,null,null,null,null,null,null,null,0,null,"","","",""]
[null,null,null,null,null,null,null,null,0,null,"","","",""]
[null,null,null,null,null,null,null,null,0,null,"","","",""]
[null,null,null,null,null,null,null,null,0,null,"","","",""]
[null,null,null,null,null,null,null,null,0,null,"","","",""]
[null,null,null,null,null,null,null,null,0,null,"","","",""]
[null,null,null,null,null,null,null,null,0,null,"","","",""]
[null,null,null,null,null,null,null,null,0,null,"","","",""]
[null,null,null,null,null,null,null,null,0,null,"","","",""]
[null,null,null,null,null,null,null,null,0,null,"","","",""]
[null,null,null,null,null,null,null,null,0,null,"","","",""]
[null,null,null,null,null,null,null,null,0,null,"","","",""]
[null,null,null,null,null,null,null,null,0,null,"","","",""]
[null,null,null,null,null,null,null,null,0,null,"","","",""]
[null,null,null,null,null,null,null,null,0,null,"","","",""]
[null,null,null,null,null,null,null,null,0,null,"","","",""]
[null,null,null,null,null,null,null,null,0,null,"","","",""]
[null,null,null,null,null,null,null,null,0,null,"","","",""]
[null,null,null,null,null,null,null,null,0,null,"","","",""]
[null,null,null,null,null,null,null,null,0,null,"","","",""]
[null,null,null,null,null,null,null,null,0,null,"","","",""]
[null,null,null,null,null,null,null,null,0,null,"","","",""]
[null,null,null,null,null,null,null,null,0,null,"","","",""]
[null,null,null,null,null,null,null,null,0,null,"","","",""]
[null,null,null,null,null,null,null,null,0,null,"","","",""]
[null,null,null,null,null,null,null,null,0,null,"","","",""]
[null,null,null,null,null,null,null,null,0,null,"","","",""]
[null,null,null,null,null,null,null,null,0,null,"","","",""]
[null,null,null,null,null,null,null,null,0,null,"","","",""]
[null,null,null,null,null,null,null,null,0,null,"","","",""]
[null,null,null,null,null,null,null,null,{"$f":"IFERROR(G2186+H2186,\"\")","v":0},null,"","","",""]
[null,null,null,null,null,null,null,null,0,null,"","","",""]
[null,null,null,null,null,null,null,null,0,null,"","","",""]
[null,null,null,null,null,null,null,null,0,null,"","","",""]
[null,null,null,null,null,null,null,null,0,null,"","","",""]
[null,null,null,null,null,null,null,null,0,null,"","","",""]
[null,null,null,null,null,null,null,null,0,null,"","","",""]
[null,null,null,null,null,null,null,null,0,null,"","","",""]
[null,null,null,null,null,null,null,null,0,null,"","","",""]
[null,null,null,null,null,null,null,null,0,null,"","","",""]
[null,null,null,null,null,null,null,null,0,null,"","","",""]
[null,null,null,null,null,null,null,null,0,null,"","","",""]
[null,null,null,null,null,null,null,null,0,null,"","","",""]
[null,null,null,null,null,null,null,null,0,null,"","","",""]
[null,null,null,null,null,null,null,null,0,null,"","","",""]
[null,null,null,null,null,null,null,null,0,null,"","","",""]
[null,null,null,null,null,null,null,null,0,null,"","","",""]
[null,null,null,null,null,null,null,null,0,null,"","","",""]
[null,null,null,null,null,null,null,null,0,null,"","","",""]
[null,null,null,null,null,null,null,null,0,null,"","","",""]
[null,null,null,null,null,null,null,null,0,null,"","","",""]
[null,null,null,null,null,null,null,null,0,null,"","","",""]
[null,null,null,null,null,null,null,null,0,null,"","","",""]
[null,null,null,null,null,null,null,null,0,null,"","","",""]
[null,null,null,null,null,null,null,null,0,null,"","","",""]
[null,null,null,null,null,null,null,null,0,null,"","","",""]
[null,null,null,null,null,null,null,null,0,null,"","","",""]
[null,null,null,null,null,null,null,null,0,null,"","","",""]
[null,null,null,null,null,null,null,null,0,null,"","","",""]
[null,null,null,null,null,null,null,null,0,null,{"$f":"IFERROR(IF(J2215<>\"\",F2215*J2215,\"\"),\"\")","v":""},{"$f":"IFERROR(IF(J2215<>\"\",G2215*J2215,\"\"),\"\")","v":""},{"$f":"IFERROR(IF(J2215<>\"\",H2215*J2215,\"\"),\"\")","v":""},{"$f":"IFERROR(L2215+M2215,\"\")","v":""}]
[null,null,null,null,null,null,null,null,0,null,"","","",""]
[null,null,null,null,null,null,null,null,0,null,"","","",""]
[null,null,null,null,null,null,null,null,0,null,"","","",""]
[null,null,null,null,null,null,null,null,0,null,"","","",""]
[null,null,null,null,null,null,null,null,0,null,"","","",""]
[null,null,null,null,null,null,null,null,0,null,"","","",""]
[null,null,null,null,null,null,null,null,0,null,"","","",""]
[null,null,null,null,null,null,null,null,0,null,"","","",""]
[null,null,null,null,null,null,null,null,0,null,"","","",""]
[null,null,null,null,null,null,null,null,0,null,"","","",""]
[null,null,null,null,null,null,null,null,0,null,"","","",""]
[null,null,null,null,null,null,null,null,0,null,"","","",""]
[null,null,null,null,null,null,null,null,0,null,"","","",""]
[null,null,null,null,null,null,null,null,0,null,"","","",""]
[null,null,null,null,null,null,null,null,0,null,"","","",""]
[null,null,null,null,null,null,null,null,0,null,"","","",""]
[null,null,null,null,null,null,null,null,0,null,"","","",""]
[null,null,null,null,null,null,null,null,0,null,"","","",""]
[null,null,null,null,null,null,null,null,0,null,"","","",""]
[null,null,null,null,null,null,null,null,0,null,"","","",""]
[null,null,null,null,null,null,null,null,0,null,"","","",""]
[null,null,null,null,null,null,null,null,0,null,"","","",""]
[null,null,null,null,null,null,null,null,0,null,"","","",""]
[null,null,null,null,null,null,null,null,0,null,"","","",""]
[null,null,null,null,null,null,null,null,0,null,"","","",""]
[null,null,null,null,null,null,null,null,0,null,"","","",""]
[null,null,null,null,null,null,null,null,0,null,"","","",""]
[null,null,null,null,null,null,null,null,0,null,"","","",""]
[null,null,null,null,null,null,null,null,0,null,"","","",""]
[null,null,null,null,null,null,null,null,0,null,"","","",""]
[null,null,null,null,null,null,null,null,0,null,"","","",""]
[null,null,null,null,null,null,null,null,0,null,"","","",""]
[null,null,null,null,null,null,null,null,0,null,"","","",""]
[null,null,null,null,null,null,null,null,0,null,"","","",""]
[null,null,null,null,null,null,null,null,{"$f":"IFERROR(G2250+H2250,\"\")","v":0},null,"","","",""]
[null,null,null,null,null,null,null,null,0,null,"","","",""]
[null,null,null,null,null,null,null,null,0,null,"","","",""]
[null,null,null,null,null,null,null,null,0,null,"","","",""]
[null,null,null,null,null,null,null,null,0,null,"","","",""]
[null,null,null,null,null,null,null,null,0,null,"","","",""]
[null,null,null,null,null,null,null,null,0,null,"","","",""]
[null,null,null,null,null,null,null,null,0,null,"","","",""]
[null,null,null,null,null,null,null,null,0,null,"","","",""]
[null,null,null,null,null,null,null,null,0,null,"","","",""]
[null,null,null,null,null,null,null,null,0,null,"","","",""]
[null,null,null,null,null,null,null,null,0,null,"","","",""]
[null,null,null,null,null,null,null,null,0,null,"","","",""]
[null,null,null,null,null,null,null,null,0,null,"","","",""]
[null,null,null,null,null,null,null,null,0,null,"","","",""]
[null,null,null,null,null,null,null,null,0,null,"","","",""]
[null,null,null,null,null,null,null,null,0,null,"","","",""]
[null,null,null,null,null,null,null,null,0,null,"","","",""]
[null,null,null,null,null,null,null,null,0,null,"","","",""]
[null,null,null,null,null,null,null,null,0,null,"","","",""]
[null,null,null,null,null,null,null,null,0,null,"","","",""]
[null,null,null,null,null,null,null,null,0,null,"","","",""]
[null,null,null,null,null,null,null,null,0,null,"","","",""]
[null,null,null,null,null,null,null,null,0,null,"","","",""]
[null,null,null,null,null,null,null,null,0,null,"","","",""]
[null,null,null,null,null,null,null,null,0,null,"","","",""]
[null,null,null,null,null,null,null,null,0,null,"","","",""]
[null,null,null,null,null,null,null,null,0,null,"","","",""]
[null,null,null,null,null,null,null,null,0,null,"","","",""]
[null,null,null,null,null,null,null,null,0,null,{"$f":"IFERROR(IF(J2279<>\"\",F2279*J2279,\"\"),\"\")","v":""},{"$f":"IFERROR(IF(J2279<>\"\",G2279*J2279,\"\"),\"\")","v":""},{"$f":"IFERROR(IF(J2279<>\"\",H2279*J2279,\"\"),\"\")","v":""},{"$f":"IFERROR(L2279+M2279,\"\")","v":""}]
[null,null,null,null,null,null,null,null,0,null,"","","",""]
[null,null,null,null,null,null,null,null,0,null,"","","",""]
[null,null,null,null,null,null,null,null,0,null,"","","",""]
[null,null,null,null,null,null,null,null,0,null,"","","",""]
[null,null,null,null,null,null,null,null,0,null,"","","",""]
[null,null,null,null,null,null,null,null,0,null,"","","",""]
[null,null,null,null,null,null,null,null,0,null,"","","",""]
[null,null,null,null,null,null,null,null,0,null,"","","",""]
[null,null,null,null,null,null,null,null,0,null,"","","",""]
[null,null,null,null,null,null,null,null,0,null,"","","",""]
[null,null,null,null,null,null,null,null,0,null,"","","",""]
[null,null,null,null,null,null,null,null,0,null,"","","",""]
[null,null,null,null,null,null,null,null,0,null,"","","",""]
[null,null,null,null,null,null,null,null,0,null,"","","",""]
[null,null,null,null,null,null,null,null,0,null,"","","",""]
[null,null,null,null,null,null,null,null,0,null,"","","",""]
[null,null,null,null,null,null,null,null,0,null,"","","",""]
[null,null,null,null,null,null,null,null,0,null,"","","",""]
[null,null,null,null,null,null,null,null,0,null,"","","",""]
[null,null,null,null,null,null,null,null,0,null,"","","",""]
[null,null,null,null,null,null,null,null,0,null,"","","",""]
[null,null,null,null,null,null,null,null,0,null,"","","",""]
[null,null,null,null,null,null,null,null,0,null,"","","",""]
[null,null,null,null,null,null,null,null,0,null,"","","",""]
[null,null,null,null,null,null,null,null,0,null,"","","",""]
[null,null,null,null,null,null,null,null,0,null,"","","",""]
[null,null,null,null,null,null,null,null,0,null,"","","",""]
[null,null,null,null,null,null,null,null,0,null,"","","",""]
[null,null,null,null,null,null,null,null,0,null,"","","",""]
[null,null,null,null,null,null,null,null,0,null,"","","",""]
[null,null,null,null,null,null,null,null,0,null,"","","",""]
[null,null,null,null,null,null,null,null,0,null,"","","",""]
[null,null,null,null,null,null,null,null,0,null,"","","",""]
[null,null,null,null,null,null,null,null,0,null,"","","",""]
[null,null,null,null,null,null,null,null,{"$f":"IFERROR(G2314+H2314,\"\")","v":0},null,"","","",""]
[null,null,null,null,null,null,null,null,0,null,"","","",""]
[null,null,null,null,null,null,null,null,0,null,"","","",""]
[null,null,null,null,null,null,null,null,0,null,"","","",""]
[null,null,null,null,null,null,null,null,0,null,"","","",""]
[null,null,null,null,null,null,null,null,0,null,"","","",""]
[null,null,null,null,null,null,null,null,0,null,"","","",""]
[null,null,null,null,null,null,null,null,0,null,"","","",""]
[null,null,null,null,null,null,null,null,0,null,"","","",""]
[null,null,null,null,null,null,null,null,0,null,"","","",""]
[null,null,null,null,null,null,null,null,0,null,"","","",""]
[null,null,null,null,null,null,null,null,0,null,"","","",""]
[null,null,null,null,null,null,null,null,0,null,"","","",""]
[null,null,null,null,null,null,null,null,0,null,"","","",""]
[null,null,null,null,null,null,null,null,0,null,"","","",""]
[null,null,null,null,null,null,null,null,0,null,"","","",""]
[null,null,null,null,null,null,null,null,0,null,"","","",""]
[null,null,null,null,null,null,null,null,0,null,"","","",""]
[null,null,null,null,null,null,null,null,0,null,"","","",""]
[null,null,null,null,null,null,null,null,0,null,"","","",""]
[null,null,null,null,null,null,null,null,0,null,"","","",""]
[null,null,null,null,null,null,null,null,0,null,"","","",""]
[null,null,null,null,null,null,null,null,0,null,"","","",""]
[null,null,null,null,null,null,null,null,0,null,"","","",""]
[null,null,null,null,null,null,null,null,0,null,"","","",""]
[null,null,null,null,null,null,null,null,0,null,"","","",""]
[null,null,null,null,null,null,null,null,0,null,"","","",""]
[null,null,null,null,null,null,null,null,0,null,"","","",""]
[null,null,null,null,null,null,null,null,0,null,"","","",""]
[null,null,null,null,null,null,null,null,0,null,{"$f":"IFERROR(IF(J2343<>\"\",F2343*J2343,\"\"),\"\")","v":""},{"$f":"IFERROR(IF(J2343<>\"\",G2343*J2343,\"\"),\"\")","v":""},{"$f":"IFERROR(IF(J2343<>\"\",H2343*J2343,\"\"),\"\")","v":""},{"$f":"IFERROR(L2343+M2343,\"\")","v":""}]
[null,null,null,null,null,null,null,null,0,null,"","","",""]
[null,null,null,null,null,null,null,null,0,null,"","","",""]
[null,null,null,null,null,null,null,null,0,null,"","","",""]
[null,null,null,null,null,null,null,null,0,null,"","","",""]
[null,null,null,null,null,null,null,null,0,null,"","","",""]
[null,null,null,null,null,null,null,null,0,null,"","","",""]
[null,null,null,null,null,null,null,null,0,null,"","","",""]
[null,null,null,null,null,null,null,null,0,null,"","","",""]
[null,null,null,null,null,null,null,null,0,null,"","","",""]
[null,null,null,null,null,null,null,null,0,null,"","","",""]
[null,null,null,null,null,null,null,null,0,null,"","","",""]
[null,null,null,null,null,null,null,null,0,null,"","","",""]
[null,null,null,null,null,null,null,null,0,null,"","","",""]
[null,null,null,null,null,null,null,null,0,null,"","","",""]
[null,null,null,null,null,null,null,null,0,null,"","","",""]
[null,null,null,null,null,null,null,null,0,null,"","","",""]
[null,null,null,null,null,null,null,null,0,null,"","","",""]
[null,null,null,null,null,null,null,null,0,null,"","","",""]
[null,null,null,null,null,null,null,null,0,null,"","","",""]
[null,null,null,null,null,null,null,null,0,null,"","","",""]
[null,null,null,null,null,null,null,null,0,null,"","","",""]
[null,null,null,null,null,null,null,null,0,null,"","","",""]
[null,null,null,null,null,null,null,null,0,null,"","","",""]
[null,null,null,null,null,null,null,null,0,null,"","","",""]
[null,null,null,null,null,null,null,null,0,null,"","","",""]
[null,null,null,null,null,null,null,null,0,null,"","","",""]
[null,null,null,null,null,null,null,null,0,null,"","","",""]
[null,null,null,null,null,null,null,null,0,null,"","","",""]
[null,null,null,null,null,null,null,null,0,null,"","","",""]
[null,null,null,null,null,null,null,null,0,null,"","","",""]
[null,null,null,null,null,null,null,null,0,null,"","","",""]
[null,null,null,null,null,null,null,null,0,null,"","","",""]
[null,null,null,null,null,null,null,null,0,null,"","","",""]
[null,null,null,null,null,null,null,null,0,null,"","","",""]
[null,null,null,null,null,null,null,null,{"$f":"IFERROR(G2378+H2378,\"\")","v":0},null,"","","",""]
[null,null,null,null,null,null,null,null,0,null,"","","",""]
[null,null,null,null,null,null,null,null,0,null,"","","",""]
[null,null,null,null,null,null,null,null,0,null,"","","",""]
[null,null,null,null,null,null,null,null,0,null,"","","",""]
[null,null,null,null,null,null,null,null,0,null,"","","",""]
[null,null,null,null,null,null,null,null,0,null,"","","",""]
[null,null,null,null,null,null,null,null,0,null,"","","",""]
[null,null,null,null,null,null,null,null,0,null,"","","",""]
[null,null,null,null,null,null,null,null,0,null,"","","",""]
[null,null,null,null,null,null,null,null,0,null,"","","",""]
[null,null,null,null,null,null,null,null,0,null,"","","",""]
[null,null,null,null,null,null,null,null,0,null,"","","",""]
[null,null,null,null,null,null,null,null,0,null,"","","",""]
[null,null,null,null,null,null,null,null,0,null,"","","",""]
[null,null,null,null,null,null,null,null,0,null,"","","",""]
[null,null,null,null,null,null,null,null,0,null,"","","",""]
[null,null,null,null,null,null,null,null,0,null,"","","",""]
[null,null,null,null,null,null,null,null,0,null,"","","",""]
[null,null,null,null,null,null,null,null,0,null,"","","",""]
[null,null,null,null,null,null,null,null,0,null,"","","",""]
[null,null,null,null,null,null,null,null,0,null,"","","",""]
[null,null,null,null,null,null,null,null,0,null,"","","",""]
[null,null,null,null,null,null,null,null,0,null,"","","",""]
[null,null,null,null,null,null,null,null,0,null,"","","",""]
[null,null,null,null,null,null,null,null,0,null,"","","",""]
[null,null,null,null,null,null,null,null,0,null,"","","",""]
[null,null,null,null,null,null,null,null,0,null,"","","",""]
[null,null,null,null,null,null,null,null,0,null,"","","",""]
[null,null,null,null,null,null,null,null,0,null,{"$f":"IFERROR(IF(J2407<>\"\",F2407*J2407,\"\"),\"\")","v":""},{"$f":"IFERROR(IF(J2407<>\"\",G2407*J2407,\"\"),\"\")","v":""},{"$f":"IFERROR(IF(J2407<>\"\",H2407*J2407,\"\"),\"\")","v":""},{"$f":"IFERROR(L2407+M2407,\"\")","v":""}]
[null,null,null,null,null,null,null,null,0,null,"","","",""]
[null,null,null,null,null,null,null,null,0,null,"","","",""]
[null,null,null,null,null,null,null,null,0,null,"","","",""]
[null,null,null,null,null,null,null,null,0,null,"","","",""]
[null,null,null,null,null,null,null,null,0,null,"","","",""]
[null,null,null,null,null,null,null,null,0,null,"","","",""]
[null,null,null,null,null,null,null,null,0,null,"","","",""]
[null,null,null,null,null,null,null,null,0,null,"","","",""]
[null,null,null,null,null,null,null,null,0,null,"","","",""]
[null,null,null,null,null,null,null,null,0,null,"","","",""]
[null,null,null,null,null,null,null,null,0,null,"","","",""]
[null,null,null,null,null,null,null,null,0,null,"","","",""]
[null,null,null,null,null,null,null,null,0,null,"","","",""]
[null,null,null,null,null,null,null,null,0,null,"","","",""]
[null,null,null,null,null,null,null,null,0,null,"","","",""]
[null,null,null,null,null,null,null,null,0,null,"","","",""]
[null,null,null,null,null,null,null,null,0,null,"","","",""]
[null,null,null,null,null,null,null,null,0,null,"","","",""]
[null,null,null,null,null,null,null,null,0,null,"","","",""]
[null,null,null,null,null,null,null,null,0,null,"","","",""]
[null,null,null,null,null,null,null,null,0,null,"","","",""]
[null,null,null,null,null,null,null,null,0,null,"","","",""]
[null,null,null,null,null,null,null,null,0,null,"","","",""]
[null,null,null,null,null,null,null,null,0,null,"","","",""]
[null,null,null,null,null,null,null,null,0,null,"","","",""]
[null,null,null,null,null,null,null,null,0,null,"","","",""]
[null,null,null,null,null,null,null,null,0,null,"","","",""]
[null,null,null,null,null,null,null,null,0,null,"","","",""]
[null,null,null,null,null,null,null,null,0,null,"","","",""]
[null,null,null,null,null,null,null,null,0,null,"","","",""]
[null,null,null,null,null,null,null,null,0,null,"","","",""]
[null,null,null,null,null,null,null,null,0,null,"","","",""]
[null,null,null,null,null,null,null,null,0,null,"","","",""]
[null,null,null,null,null,null,null,null,0,null,"","","",""]
[null,null,null,null,null,null,null,null,{"$f":"IFERROR(G2442+H2442,\"\")","v":0},null,"","","",""]
[null,null,null,null,null,null,null,null,0,null,"","","",""]
[null,null,null,null,null,null,null,null,0,null,"","","",""]
[null,null,null,null,null,null,null,null,0,null,"","","",""]
[null,null,null,null,null,null,null,null,0,null,"","","",""]
[null,null,null,null,null,null,null,null,0,null,"","","",""]
[null,null,null,null,null,null,null,null,0,null,"","","",""]
[null,null,null,null,null,null,null,null,0,null,"","","",""]
[null,null,null,null,null,null,null,null,0,null,"","","",""]
[null,null,null,null,null,null,null,null,0,null,"","","",""]
[null,null,null,null,null,null,null,null,0,null,"","","",""]
[null,null,null,null,null,null,null,null,0,null,"","","",""]
[null,null,null,null,null,null,null,null,0,null,"","","",""]
[null,null,null,null,null,null,null,null,0,null,"","","",""]
[null,null,null,null,null,null,null,null,0,null,"","","",""]
[null,null,null,null,null,null,null,null,0,null,"","","",""]
[null,null,null,null,null,null,null,null,0,null,"","","",""]
[null,null,null,null,null,null,null,null,0,null,"","","",""]
[null,null,null,null,null,null,null,null,0,null,"","","",""]
[null,null,null,null,null,null,null,null,0,null,"","","",""]
[null,null,null,null,null,null,null,null,0,null,"","","",""]
[null,null,null,null,null,null,null,null,0,null,"","","",""]
[null,null,null,null,null,null,null,null,0,null,"","","",""]
[null,null,null,null,null,null,null,null,0,null,"","","",""]
[null,null,null,null,null,null,null,null,0,null,"","","",""]
[null,null,null,null,null,null,null,null,0,null,"","","",""]
[null,null,null,null,null,null,null,null,0,null,"","","",""]
[null,null,null,null,null,null,null,null,0,null,"","","",""]
[null,null,null,null,null,null,null,null,0,null,"","","",""]
[null,null,null,null,null,null,null,null,0,null,{"$f":"IFERROR(IF(J2471<>\"\",F2471*J2471,\"\"),\"\")","v":""},{"$f":"IFERROR(IF(J2471<>\"\",G2471*J2471,\"\"),\"\")","v":""},{"$f":"IFERROR(IF(J2471<>\"\",H2471*J2471,\"\"),\"\")","v":""},{"$f":"IFERROR(L2471+M2471,\"\")","v":""}]
[null,null,null,null,null,null,null,null,0,null,"","","",""]
[null,null,null,null,null,null,null,null,0,null,"","","",""]
[null,null,null,null,null,null,null,null,0,null,"","","",""]
[null,null,null,null,null,null,null,null,0,null,"","","",""]
[null,null,null,null,null,null,null,null,0,null,"","","",""]
[null,null,null,null,null,null,null,null,0,null,"","","",""]
[null,null,null,null,null,null,null,null,0,null,"","","",""]
[null,null,null,null,null,null,null,null,0,null,"","","",""]
[null,null,null,null,null,null,null,null,0,null,"","","",""]
[null,null,null,null,null,null,null,null,0,null,"","","",""]
[null,null,null,null,null,null,null,null,0,null,"","","",""]
[null,null,null,null,null,null,null,null,0,null,"","","",""]
[null,null,null,null,null,null,null,null,0,null,"","","",""]
[null,null,null,null,null,null,null,null,0,null,"","","",""]
[null,null,null,null,null,null,null,null,0,null,"","","",""]
[null,null,null,null,null,null,null,null,0,null,"","","",""]
[null,null,null,null,null,null,null,null,0,null,"","","",""]
[null,null,null,null,null,null,null,null,0,null,"","","",""]
[null,null,null,null,null,null,null,null,0,null,"","","",""]
[null,null,null,null,null,null,null,null,0,null,"","","",""]
[null,null,null,null,null,null,null,null,0,null,"","","",""]
[null,null,null,null,null,null,null,null,0,null,"","","",""]
[null,null,null,null,null,null,null,null,0,null,"","","",""]
[null,null,null,null,null,null,null,null,0,null,"","","",""]
[null,null,null,null,null,null,null,null,0,null,"","","",""]
[null,null,null,null,null,null,null,null,0,null,"","","",""]
[null,null,null,null,null,null,null,null,0,null,"","","",""]
[null,null,null,null,null,null,null,null,0,null,"","","",""]
[null,null,null,null,null,null,null,null,0,null,"","","",""]
[null,null,null,null,null,null,null,null,0,null,"","","",""]
[null,null,null,null,null,null,null,null,0,null,"","","",""]
[null,null,null,null,null,null,null,null,0,null,"","","",""]
[null,null,null,null,null,null,null,null,0,null,"","","",""]
[null,null,null,null,null,null,null,null,0,null,"","","",""]
[null,null,null,null,null,null,null,null,{"$f":"IFERROR(G2506+H2506,\"\")","v":0},null,"","","",""]
[null,null,null,null,null,null,null,null,0,null,"","","",""]
[null,null,null,null,null,null,null,null,0,null,"","","",""]
[null,null,null,null,null,null,null,null,0,null,"","","",""]
[null,null,null,null,null,null,null,null,0,null,"","","",""]
[null,null,null,null,null,null,null,null,0,null,"","","",""]
[null,null,null,null,null,null,null,null,0,null,"","","",""]
[null,null,null,null,null,null,null,null,0,null,"","","",""]
[null,null,null,null,null,null,null,null,0,null,"","","",""]
[null,null,null,null,null,null,null,null,0,null,"","","",""]
[null,null,null,null,null,null,null,null,0,null,"","","",""]
[null,null,null,null,null,null,null,null,0,null,"","","",""]
[null,null,null,null,null,null,null,null,0,null,"","","",""]
[null,null,null,null,null,null,null,null,0,null,"","","",""]
[null,null,null,null,null,null,null,null,0,null,"","","",""]
[null,null,null,null,null,null,null,null,0,null,"","","",""]
[null,null,null,null,null,null,null,null,0,null,"","","",""]
[null,null,null,null,null,null,null,null,0,null,"","","",""]
[null,null,null,null,null,null,null,null,0,null,"","","",""]
[null,null,null,null,null,null,null,null,0,null,"","","",""]
[null,null,null,null,null,null,null,null,0,null,"","","",""]
[null,null,null,null,null,null,null,null,0,null,"","","",""]
[null,null,null,null,null,null,null,null,0,null,"","","",""]
[null,null,null,null,null,null,null,null,0,null,"","","",""]
[null,null,null,null,null,null,null,null,0,null,"","","",""]
[null,null,null,null,null,null,null,null,0,null,"","","",""]
[null,null,null,null,null,null,null,null,0,null,"","","",""]
[null,null,null,null,null,null,null,null,0,null,"","","",""]
[null,null,null,null,null,null,null,null,0,null,"","","",""]
[null,null,null,null,null,null,null,null,0,null,{"$f":"IFERROR(IF(J2535<>\"\",F2535*J2535,\"\"),\"\")","v":""},{"$f":"IFERROR(IF(J2535<>\"\",G2535*J2535,\"\"),\"\")","v":""},{"$f":"IFERROR(IF(J2535<>\"\",H2535*J2535,\"\"),\"\")","v":""},{"$f":"IFERROR(L2535+M2535,\"\")","v":""}]
[null,null,null,null,null,null,null,null,0,null,"","","",""]
[null,null,null,null,null,null,null,null,0,null,"","","",""]
[null,null,null,null,null,null,null,null,0,null,"","","",""]
[null,null,null,null,null,null,null,null,0,null,"","","",""]
[null,null,null,null,null,null,null,null,0,null,"","","",""]
[null,null,null,null,null,null,null,null,0,null,"","","",""]
[null,null,null,null,null,null,null,null,0,null,"","","",""]
[null,null,null,null,null,null,null,null,0,null,"","","",""]
[null,null,null,null,null,null,null,null,0,null,"","","",""]
[null,null,null,null,null,null,null,null,0,null,"","","",""]
[null,null,null,null,null,null,null,null,0,null,"","","",""]
[null,null,null,null,null,null,null,null,0,null,"","","",""]
[null,null,null,null,null,null,null,null,0,null,"","","",""]
[null,null,null,null,null,null,null,null,0,null,"","","",""]
[null,null,null,null,null,null,null,null,0,null,"","","",""]
[null,null,null,null,null,null,null,null,0,null,"","","",""]
[null,null,null,null,null,null,null,null,0,null,"","","",""]
[null,null,null,null,null,null,null,null,0,null,"","","",""]
[null,null,null,null,null,null,null,null,0,null,"","","",""]
[null,null,null,null,null,null,null,null,0,null,"","","",""]
[null,null,null,null,null,null,null,null,0,null,"","","",""]
[null,null,null,null,null,null,null,null,0,null,"","","",""]
[null,null,null,null,null,null,null,null,0,null,"","","",""]
[null,null,null,null,null,null,null,null,0,null,"","","",""]
[null,null,null,null,null,null,null,null,0,null,"","","",""]
[null,null,null,null,null,null,null,null,0,null,"","","",""]
[null,null,null,null,null,null,null,null,0,null,"","","",""]
[null,null,null,null,null,null,null,null,0,null,"","","",""]
[null,null,null,null,null,null,null,null,0,null,"","","",""]
[null,null,null,null,null,null,null,null,0,null,"","","",""]
[null,null,null,null,null,null,null,null,0,null,"","","",""]
[null,null,null,null,null,null,null,null,0,null,"","","",""]
[null,null,null,null,null,null,null,null,0,null,"","","",""]
[null,null,null,null,null,null,null,null,0,null,"","","",""]
[null,null,null,null,null,null,null,null,{"$f":"IFERROR(G2570+H2570,\"\")","v":0},null,"","","",""]
[null,null,null,null,null,null,null,null,0,null,"","","",""]
[null,null,null,null,null,null,null,null,0,null,"","","",""]
[null,null,null,null,null,null,null,null,0,null,"","","",""]
[null,null,null,null,null,null,null,null,0,null,"","","",""]
[null,null,null,null,null,null,null,null,0,null,"","","",""]
[null,null,null,null,null,null,null,null,0,null,"","","",""]
[null,null,null,null,null,null,null,null,0,null,"","","",""]
[null,null,null,null,null,null,null,null,0,null,"","","",""]
[null,null,null,null,null,null,null,null,0,null,"","","",""]
[null,null,null,null,null,null,null,null,0,null,"","","",""]
[null,null,null,null,null,null,null,null,0,null,"","","",""]
[null,null,null,null,null,null,null,null,0,null,"","","",""]
[null,null,null,null,null,null,null,null,0,null,"","","",""]
[null,null,null,null,null,null,null,null,0,null,"","","",""]
[null,null,null,null,null,null,null,null,0,null,"","","",""]
[null,null,null,null,null,null,null,null,0,null,"","","",""]
[null,null,null,null,null,null,null,null,0,null,"","","",""]
[null,null,null,null,null,null,null,null,0,null,"","","",""]
[null,null,null,null,null,null,null,null,0,null,"","","",""]
[null,null,null,null,null,null,null,null,0,null,"","","",""]
[null,null,null,null,null,null,null,null,0,null,"","","",""]
[null,null,null,null,null,null,null,null,0,null,"","","",""]
[null,null,null,null,null,null,null,null,0,null,"","","",""]
[null,null,null,null,null,null,null,null,0,null,"","","",""]
[null,null,null,null,null,null,null,null,0,null,"","","",""]
[null,null,null,null,null,null,null,null,0,null,"","","",""]
[null,null,null,null,null,null,null,null,0,null,"","","",""]
[null,null,null,null,null,null,null,null,0,null,"","","",""]
[null,null,null,null,null,null,null,null,0,null,{"$f":"IFERROR(IF(J2599<>\"\",F2599*J2599,\"\"),\"\")","v":""},{"$f":"IFERROR(IF(J2599<>\"\",G2599*J2599,\"\"),\"\")","v":""},{"$f":"IFERROR(IF(J2599<>\"\",H2599*J2599,\"\"),\"\")","v":""},{"$f":"IFERROR(L2599+M2599,\"\")","v":""}]
[null,null,null,null,null,null,null,null,0,null,"","","",""]
[null,null,null,null,null,null,null,null,0,null,"","","",""]
[null,null,null,null,null,null,null,null,0,null,"","","",""]
[null,null,null,null,null,null,null,null,0,null,"","","",""]
[null,null,null,null,null,null,null,null,0,null,"","","",""]
[null,null,null,null,null,null,null,null,0,null,"","","",""]
[null,null,null,null,null,null,null,null,0,null,"","","",""]
[null,null,null,null,null,null,null,null,0,null,"","","",""]
[null,null,null,null,null,null,null,null,0,null,"","","",""]
[null,null,null,null,null,null,null,null,0,null,"","","",""]
[null,null,null,null,null,null,null,null,0,null,"","","",""]
[null,null,null,null,null,null,null,null,0,null,"","","",""]
[null,null,null,null,null,null,null,null,0,null,"","","",""]
[null,null,null,null,null,null,null,null,0,null,"","","",""]
[null,null,null,null,null,null,null,null,0,null,"","","",""]
[null,null,null,null,null,null,null,null,0,null,"","","",""]
[null,null,null,null,null,null,null,null,0,null,"","","",""]
[null,null,null,null,null,null,null,null,0,null,"","","",""]
[null,null,null,null,null,null,null,null,0,null,"","","",""]
[null,null,null,null,null,null,null,null,0,null,"","","",""]
[null,null,null,null,null,null,null,null,0,null,"","","",""]
[null,null,null,null,null,null,null,null,0,null,"","","",""]
[null,null,null,null,null,null,null,null,0,null,"","","",""]
[null,null,null,null,null,null,null,null,0,null,"","","",""]
[null,null,null,null,null,null,null,null,0,null,"","","",""]
[null,null,null,null,null,null,null,null,0,null,"","","",""]
[null,null,null,null,null,null,null,null,0,null,"","","",""]
[null,null,null,null,null,null,null,null,0,null,"","","",""]
[null,null,null,null,null,null,null,null,0,null,"","","",""]
[null,null,null,null,null,null,null,null,0,null,"","","",""]
[null,null,null,null,null,null,null,null,0,null,"","","",""]
[null,null,null,null,null,null,null,null,0,null,"","","",""]
[null,null,null,null,null,null,null,null,0,null,"","","",""]
[null,null,null,null,null,null,null,null,0,null,"","","",""]
[null,null,null,null,null,null,null,null,{"$f":"IFERROR(G2634+H2634,\"\")","v":0},null,"","","",""]
[null,null,null,null,null,null,null,null,0,null,"","","",""]
[null,null,null,null,null,null,null,null,0,null,"","","",""]
[null,null,null,null,null,null,null,null,0,null,"","","",""]
[null,null,null,null,null,null,null,null,0,null,"","","",""]
[null,null,null,null,null,null,null,null,0,null,"","","",""]
[null,null,null,null,null,null,null,null,0,null,"","","",""]
[null,null,null,null,null,null,null,null,0,null,"","","",""]
[null,null,null,null,null,null,null,null,0,null,"","","",""]
[null,null,null,null,null,null,null,null,0,null,"","","",""]
[null,null,null,null,null,null,null,null,0,null,"","","",""]
[null,null,null,null,null,null,null,null,0,null,"","","",""]
[null,null,null,null,null,null,null,null,0,null,"","","",""]
[null,null,null,null,null,null,null,null,0,null,"","","",""]
[null,null,null,null,null,null,null,null,0,null,"","","",""]
[null,null,null,null,null,null,null,null,0,null,"","","",""]
[null,null,null,null,null,null,null,null,0,null,"","","",""]
[null,null,null,null,null,null,null,null,0,null,"","","",""]
[null,null,null,null,null,null,null,null,0,null,"","","",""]
[null,null,null,null,null,null,null,null,0,null,"","","",""]
[null,null,null,null,null,null,null,null,0,null,"","","",""]
[null,null,null,null,null,null,null,null,0,null,"","","",""]
[null,null,null,null,null,null,null,null,0,null,"","","",""]
[null,null,null,null,null,null,null,null,0,null,"","","",""]
[null,null,null,null,null,null,null,null,0,null,"","","",""]
[null,null,null,null,null,null,null,null,0,null,"","","",""]
[null,null,null,null,null,null,null,null,0,null,"","","",""]
[null,null,null,null,null,null,null,null,0,null,"","","",""]
[null,null,null,null,null,null,null,null,0,null,"","","",""]
[null,null,null,null,null,null,null,null,0,null,{"$f":"IFERROR(IF(J2663<>\"\",F2663*J2663,\"\"),\"\")","v":""},{"$f":"IFERROR(IF(J2663<>\"\",G2663*J2663,\"\"),\"\")","v":""},{"$f":"IFERROR(IF(J2663<>\"\",H2663*J2663,\"\"),\"\")","v":""},{"$f":"IFERROR(L2663+M2663,\"\")","v":""}]
[null,null,null,null,null,null,null,null,0,null,"","","",""]
[null,null,null,null,null,null,null,null,0,null,"","","",""]
[null,null,null,null,null,null,null,null,0,null,"","","",""]
[null,null,null,null,null,null,null,null,0,null,"","","",""]
[null,null,null,null,null,null,null,null,0,null,"","","",""]
[null,null,null,null,null,null,null,null,0,null,"","","",""]
[null,null,null,null,null,null,null,null,0,null,"","","",""]
[null,null,null,null,null,null,null,null,0,null,"","","",""]
[null,null,null,null,null,null,null,null,0,null,"","","",""]
[null,null,null,null,null,null,null,null,0,null,"","","",""]
[null,null,null,null,null,null,null,null,0,null,"","","",""]
[null,null,null,null,null,null,null,null,0,null,"","","",""]
[null,null,null,null,null,null,null,null,0,null,"","","",""]
[null,null,null,null,null,null,null,null,0,null,"","","",""]
[null,null,null,null,null,null,null,null,0,null,"","","",""]
[null,null,null,null,null,null,null,null,0,null,"","","",""]
[null,null,null,null,null,null,null,null,0,null,"","","",""]
[null,null,null,null,null,null,null,null,0,null,"","","",""]
[null,null,null,null,null,null,null,null,0,null,"","","",""]
[null,null,null,null,null,null,null,null,0,null,"","","",""]
[null,null,null,null,null,null,null,null,0,null,"","","",""]
[null,null,null,null,null,null,null,null,0,null,"","","",""]
[null,null,null,null,null,null,null,null,0,null,"","","",""]
[null,null,null,null,null,null,null,null,0,null,"","","",""]
[null,null,null,null,null,null,null,null,0,null,"","","",""]
[null,null,null,null,null,null,null,null,0,null,"","","",""]
[null,null,null,null,null,null,null,null,0,null,"","","",""]
[null,null,null,null,null,null,null,null,0,null,"","","",""]
[null,null,null,null,null,null,null,null,0,null,"","","",""]
[null,null,null,null,null,null,null,null,0,null,"","","",""]
[null,null,null,null,null,null,null,null,0,null,"","","",""]
[null,null,null,null,null,null,null,null,0,null,"","","",""]
[null,null,null,null,null,null,null,null,0,null,"","","",""]
[null,null,null,null,null,null,null,null,0,null,"","","",""]
[null,null,null,null,null,null,null,null,{"$f":"IFERROR(G2698+H2698,\"\")","v":0},null,"","","",""]
[null,null,null,null,null,null,null,null,0,null,"","","",""]
[null,null,null,null,null,null,null,null,0,null,"","","",""]
[null,null,null,null,null,null,null,null,0,null,"","","",""]
[null,null,null,null,null,null,null,null,0,null,"","","",""]
[null,null,null,null,null,null,null,null,0,null,"","","",""]
[null,null,null,null,null,null,null,null,0,null,"","","",""]
[null,null,null,null,null,null,null,null,0,null,"","","",""]
[null,null,null,null,null,null,null,null,0,null,"","","",""]
[null,null,null,null,null,null,null,null,0,null,"","","",""]
[null,null,null,null,null,null,null,null,0,null,"","","",""]
[null,null,null,null,null,null,null,null,0,null,"","","",""]
[null,null,null,null,null,null,null,null,0,null,"","","",""]
[null,null,null,null,null,null,null,null,0,null,"","","",""]
[null,null,null,null,null,null,null,null,0,null,"","","",""]
[null,null,null,null,null,null,null,null,0,null,"","","",""]
[null,null,null,null,null,null,null,null,0,null,"","","",""]
[null,null,null,null,null,null,null,null,0,null,"","","",""]
[null,null,null,null,null,null,null,null,0,null,"","","",""]
[null,null,null,null,null,null,null,null,0,null,"","","",""]
[null,null,null,null,null,null,null,null,0,null,"","","",""]
[null,null,null,null,null,null,null,null,0,null,"","","",""]
[null,null,null,null,null,null,null,null,0,null,"","","",""]
[null,null,null,null,null,null,null,null,0,null,"","","",""]
[null,null,null,null,null,null,null,null,0,null,"","","",""]
[null,null,null,null,null,null,null,null,0,null,"","","",""]
[null,null,null,null,null,null,null,null,0,null,"","","",""]
[null,null,null,null,null,null,null,null,0,null,"","","",""]
[null,null,null,null,null,null,null,null,0,null,"","","",""]
[null,null,null,null,null,null,null,null,0,null,{"$f":"IFERROR(IF(J2727<>\"\",F2727*J2727,\"\"),\"\")","v":""},{"$f":"IFERROR(IF(J2727<>\"\",G2727*J2727,\"\"),\"\")","v":""},{"$f":"IFERROR(IF(J2727<>\"\",H2727*J2727,\"\"),\"\")","v":""},{"$f":"IFERROR(L2727+M2727,\"\")","v":""}]
[null,null,null,null,null,null,null,null,0,null,"","","",""]
[null,null,null,null,null,null,null,null,0,null,"","","",""]
[null,null,null,null,null,null,null,null,0,null,"","","",""]
[null,null,null,null,null,null,null,null,0,null,"","","",""]
[null,null,null,null,null,null,null,null,0,null,"","","",""]
[null,null,null,null,null,null,null,null,0,null,"","","",""]
[null,null,null,null,null,null,null,null,0,null,"","","",""]
[null,null,null,null,null,null,null,null,0,null,"","","",""]
[null,null,null,null,null,null,null,null,0,null,"","","",""]
[null,null,null,null,null,null,null,null,0,null,"","","",""]
[null,null,null,null,null,null,null,null,0,null,"","","",""]
[null,null,null,null,null,null,null,null,0,null,"","","",""]
[null,null,null,null,null,null,null,null,0,null,"","","",""]
[null,null,null,null,null,null,null,null,0,null,"","","",""]
[null,null,null,null,null,null,null,null,0,null,"","","",""]
[null,null,null,null,null,null,null,null,0,null,"","","",""]
[null,null,null,null,null,null,null,null,0,null,"","","",""]
[null,null,null,null,null,null,null,null,0,null,"","","",""]
[null,null,null,null,null,null,null,null,0,null,"","","",""]
[null,null,null,null,null,null,null,null,0,null,"","","",""]
[null,null,null,null,null,null,null,null,0,null,"","","",""]
[null,null,null,null,null,null,null,null,0,null,"","","",""]
[null,null,null,null,null,null,null,null,0,null,"","","",""]
[null,null,null,null,null,null,null,null,0,null,"","","",""]
[null,null,null,null,null,null,null,null,0,null,"","","",""]
[null,null,null,null,null,null,null,null,0,null,"","","",""]
[null,null,null,null,null,null,null,null,0,null,"","","",""]
[null,null,null,null,null,null,null,null,0,null,"","","",""]
[null,null,null,null,null,null,null,null,0,null,"","","",""]
[null,null,null,null,null,null,null,null,0,null,"","","",""]
[null,null,null,null,null,null,null,null,0,null,"","","",""]
[null,null,null,null,null,null,null,null,0,null,"","","",""]
[null,null,null,null,null,null,null,null,0,null,"","","",""]
[null,null,null,null,null,null,null,null,0,null,"","","",""]
[null,null,null,null,null,null,null,null,{"$f":"IFERROR(G2762+H2762,\"\")","v":0},null,"","","",""]
[null,null,null,null,null,null,null,null,0,null,"","","",""]
[null,null,null,null,null,null,null,null,0,null,"","","",""]
[null,null,null,null,null,null,null,null,0,null,"","","",""]
[null,null,null,null,null,null,null,null,0,null,"","","",""]
[null,null,null,null,null,null,null,null,0,null,"","","",""]
[null,null,null,null,null,null,null,null,0,null,"","","",""]
[null,null,null,null,null,null,null,null,0,null,"","","",""]
[null,null,null,null,null,null,null,null,0,null,"","","",""]
[null,null,null,null,null,null,null,null,0,null,"","","",""]
[null,null,null,null,null,null,null,null,0,null,"","","",""]
[null,null,null,null,null,null,null,null,0,null,"","","",""]
[null,null,null,null,null,null,null,null,0,null,"","","",""]
[null,null,null,null,null,null,null,null,0,null,"","","",""]
[null,null,null,null,null,null,null,null,0,null,"","","",""]
[null,null,null,null,null,null,null,null,0,null,"","","",""]
[null,null,null,null,null,null,null,null,0,null,"","","",""]
[null,null,null,null,null,null,null,null,0,null,"","","",""]
[null,null,null,null,null,null,null,null,0,null,"","","",""]
[null,null,null,null,null,null,null,null,0,null,"","","",""]
[null,null,null,null,null,null,null,null,0,null,"","","",""]
[null,null,null,null,null,null,null,null,0,null,"","","",""]
[null,null,null,null,null,null,null,null,0,null,"","","",""]
[null,null,null,null,null,null,null,null,0,null,"","","",""]
[null,null,null,null,null,null,null,null,0,null,"","","",""]
[null,null,null,null,null,null,null,null,0,null,"","","",""]
[null,null,null,null,null,null,null,null,0,null,"","","",""]
[null,null,null,null,null,null,null,null,0,null,"","","",""]
[null,null,null,null,null,null,null,null,0,null,"","","",""]
[null,null,null,null,null,null,null,null,0,null,{"$f":"IFERROR(IF(J2791<>\"\",F2791*J2791,\"\"),\"\")","v":""},{"$f":"IFERROR(IF(J2791<>\"\",G2791*J2791,\"\"),\"\")","v":""},{"$f":"IFERROR(IF(J2791<>\"\",H2791*J2791,\"\"),\"\")","v":""},{"$f":"IFERROR(L2791+M2791,\"\")","v":""}]
[null,null,null,null,null,null,null,null,0,null,"","","",""]
[null,null,null,null,null,null,null,null,0,null,"","","",""]
[null,null,null,null,null,null,null,null,0,null,"","","",""]
[null,null,null,null,null,null,null,null,0,null,"","","",""]
[null,null,null,null,null,null,null,null,0,null,"","","",""]
[null,null,null,null,null,null,null,null,0,null,"","","",""]
[null,null,null,null,null,null,null,null,0,null,"","","",""]
[null,null,null,null,null,null,null,null,0,null,"","","",""]
[null,null,null,null,null,null,null,null,0,null,"","","",""]
[null,null,null,null,null,null,null,null,0,null,"","","",""]
[null,null,null,null,null,null,null,null,0,null,"","","",""]
[null,null,null,null,null,null,null,null,0,null,"","","",""]
[null,null,null,null,null,null,null,null,0,null,"","","",""]
[null,null,null,null,null,null,null,null,0,null,"","","",""]
[null,null,null,null,null,null,null,null,0,null,"","","",""]
[null,null,null,null,null,null,null,null,0,null,"","","",""]
[null,null,null,null,null,null,null,null,0,null,"","","",""]
[null,null,null,null,null,null,null,null,0,null,"","","",""]
[null,null,null,null,null,null,null,null,0,null,"","","",""]
[null,null,null,null,null,null,null,null,0,null,"","","",""]
[null,null,null,null,null,null,null,null,0,null,"","","",""]
[null,null,null,null,null,null,null,null,0,null,"","","",""]
[null,null,null,null,null,null,null,null,0,null,"","","",""]
[null,null,null,null,null,null,null,null,0,null,"","","",""]
[null,null,null,null,null,null,null,null,0,null,"","","",""]
[null,null,null,null,null,null,null,null,0,null,"","","",""]
[null,null,null,null,null,null,null,null,0,null,"","","",""]
[null,null,null,null,null,null,null,null,0,null,"","","",""]
[null,null,null,null,null,null,null,null,0,null,"","","",""]
[null,null,null,null,null,null,null,null,0,null,"","","",""]
[null,null,null,null,null,null,null,null,0,null,"","","",""]
[null,null,null,null,null,null,null,null,0,null,"","","",""]
[null,null,null,null,null,null,null,null,0,null,"","","",""]
[null,null,null,null,null,null,null,null,0,null,"","","",""]
[null,null,null,null,null,null,null,null,{"$f":"IFERROR(G2826+H2826,\"\")","v":0},null,"","","",""]
[null,null,null,null,null,null,null,null,0,null,"","","",""]
[null,null,null,null,null,null,null,null,0,null,"","","",""]
[null,null,null,null,null,null,null,null,0,null,"","","",""]
[null,null,null,null,null,null,null,null,0,null,"","","",""]
[null,null,null,null,null,null,null,null,0,null,"","","",""]
[null,null,null,null,null,null,null,null,0,null,"","","",""]
[null,null,null,null,null,null,null,null,0,null,"","","",""]
[null,null,null,null,null,null,null,null,0,null,"","","",""]
[null,null,null,null,null,null,null,null,0,null,"","","",""]
[null,null,null,null,null,null,null,null,0,null,"","","",""]
[null,null,null,null,null,null,null,null,0,null,"","","",""]
[null,null,null,null,null,null,null,null,0,null,"","","",""]
[null,null,null,null,null,null,null,null,0,null,"","","",""]
[null,null,null,null,null,null,null,null,0,null,"","","",""]
[null,null,null,null,null,null,null,null,0,null,"","","",""]
[null,null,null,null,null,null,null,null,0,null,"","","",""]
[null,null,null,null,null,null,null,null,0,null,"","","",""]
[null,null,null,null,null,null,null,null,0,null,"","","",""]
[null,null,null,null,null,null,null,null,0,null,"","","",""]
[null,null,null,null,null,null,null,null,0,null,"","","",""]
[null,null,null,null,null,null,null,null,0,null,"","","",""]
[null,null,null,null,null,null,null,null,0,null,"","","",""]
[null,null,null,null,null,null,null,null,0,null,"","","",""]
[null,null,null,null,null,null,null,null,0,null,"","","",""]
[null,null,null,null,null,null,null,null,0,null,"","","",""]
[null,null,null,null,null,null,null,null,0,null,"","","",""]
[null,null,null,null,null,null,null,null,0,null,"","","",""]
[null,null,null,null,null,null,null,null,0,null,"","","",""]
[null,null,null,null,null,null,null,null,0,null,{"$f":"IFERROR(IF(J2855<>\"\",F2855*J2855,\"\"),\"\")","v":""},{"$f":"IFERROR(IF(J2855<>\"\",G2855*J2855,\"\"),\"\")","v":""},{"$f":"IFERROR(IF(J2855<>\"\",H2855*J2855,\"\"),\"\")","v":""},{"$f":"IFERROR(L2855+M2855,\"\")","v":""}]
[null,null,null,null,null,null,null,null,0,null,"","","",""]
[null,null,null,null,null,null,null,null,0,null,"","","",""]
[null,null,null,null,null,null,null,null,0,null,"","","",""]
[null,null,null,null,null,null,null,null,0,null,"","","",""]
[null,null,null,null,null,null,null,null,0,null,"","","",""]
[null,null,null,null,null,null,null,null,0,null,"","","",""]
[null,null,null,null,null,null,null,null,0,null,"","","",""]
[null,null,null,null,null,null,null,null,0,null,"","","",""]
[null,null,null,null,null,null,null,null,0,null,"","","",""]
[null,null,null,null,null,null,null,null,0,null,"","","",""]
[null,null,null,null,null,null,null,null,0,null,"","","",""]
[null,null,null,null,null,null,null,null,0,null,"","","",""]
[null,null,null,null,null,null,null,null,0,null,"","","",""]
[null,null,null,null,null,null,null,null,0,null,"","","",""]
[null,null,null,null,null,null,null,null,0,null,"","","",""]
[null,null,null,null,null,null,null,null,0,null,"","","",""]
[null,null,null,null,null,null,null,null,0,null,"","","",""]
[null,null,null,null,null,null,null,null,0,null,"","","",""]
[null,null,null,null,null,null,null,null,0,null,"","","",""]
[null,null,null,null,null,null,null,null,0,null,"","","",""]
[null,null,null,null,null,null,null,null,0,null,"","","",""]
[null,null,null,null,null,null,null,null,0,null,"","","",""]
[null,null,null,null,null,null,null,null,0,null,"","","",""]
[null,null,null,null,null,null,null,null,0,null,"","","",""]
[null,null,null,null,null,null,null,null,0,null,"","","",""]
[null,null,null,null,null,null,null,null,0,null,"","","",""]
[null,null,null,null,null,null,null,null,0,null,"","","",""]
[null,null,null,null,null,null,null,null,0,null,"","","",""]
[null,null,null,null,null,null,null,null,0,null,"","","",""]
[null,null,null,null,null,null,null,null,0,null,"","","",""]
[null,null,null,null,null,null,null,null,0,null,"","","",""]
[null,null,null,null,null,null,null,null,0,null,"","","",""]
[null,null,null,null,null,null,null,null,0,null,"","","",""]
[null,null,null,null,null,null,null,null,0,null,"","","",""]
[null,null,null,null,null,null,null,null,{"$f":"IFERROR(G2890+H2890,\"\")","v":0},null,"","","",""]
[null,null,null,null,null,null,null,null,0,null,"","","",""]
[null,null,null,null,null,null,null,null,0,null,"","","",""]
[null,null,null,null,null,null,null,null,0,null,"","","",""]
[null,null,null,null,null,null,null,null,0,null,"","","",""]
[null,null,null,null,null,null,null,null,0,null,"","","",""]
[null,null,null,null,null,null,null,null,0,null,"","","",""]
[null,null,null,null,null,null,null,null,0,null,"","","",""]
[null,null,null,null,null,null,null,null,0,null,"","","",""]
[null,null,null,null,null,null,null,null,0,null,"","","",""]
[null,null,null,null,null,null,null,null,0,null,"","","",""]
[null,null,null,null,null,null,null,null,0,null,"","","",""]
[null,null,null,null,null,null,null,null,0,null,"","","",""]
[null,null,null,null,null,null,null,null,0,null,"","","",""]
[null,null,null,null,null,null,null,null,0,null,"","","",""]
[null,null,null,null,null,null,null,null,0,null,"","","",""]
[null,null,null,null,null,null,null,null,0,null,"","","",""]
[null,null,null,null,null,null,null,null,0,null,"","","",""]
[null,null,null,null,null,null,null,null,0,null,"","","",""]
[null,null,null,null,null,null,null,null,0,null,"","","",""]
[null,null,null,null,null,null,null,null,0,null,"","","",""]
[null,null,null,null,null,null,null,null,0,null,"","","",""]
[null,null,null,null,null,null,null,null,0,null,"","","",""]
[null,null,null,null,null,null,null,null,0,null,"","","",""]
[null,null,null,null,null,null,null,null,0,null,"","","",""]
[null,null,null,null,null,null,null,null,0,null,"","","",""]
[null,null,null,null,null,null,null,null,0,null,"","","",""]
[null,null,null,null,null,null,null,null,0,null,"","","",""]
[null,null,null,null,null,null,null,null,0,null,"","","",""]
[null,null,null,null,null,null,null,null,0,null,{"$f":"IFERROR(IF(J2919<>\"\",F2919*J2919,\"\"),\"\")","v":""},{"$f":"IFERROR(IF(J2919<>\"\",G2919*J2919,\"\"),\"\")","v":""},{"$f":"IFERROR(IF(J2919<>\"\",H2919*J2919,\"\"),\"\")","v":""},{"$f":"IFERROR(L2919+M2919,\"\")","v":""}]
[null,null,null,null,null,null,null,null,0,null,"","","",""]
[null,null,null,null,null,null,null,null,0,null,"","","",""]
[null,null,null,null,null,null,null,null,0,null,"","","",""]
[null,null,null,null,null,null,null,null,0,null,"","","",""]
[null,null,null,null,null,null,null,null,0,null,"","","",""]
[null,null,null,null,null,null,null,null,0,null,"","","",""]
[null,null,null,null,null,null,null,null,0,null,"","","",""]
[null,null,null,null,null,null,null,null,0,null,"","","",""]
[null,null,null,null,null,null,null,null,0,null,"","","",""]
[null,null,null,null,null,null,null,null,0,null,"","","",""]
[null,null,null,null,null,null,null,null,0,null,"","","",""]
[null,null,null,null,null,null,null,null,0,null,"","","",""]
[null,null,null,null,null,null,null,null,0,null,"","","",""]
[null,null,null,null,null,null,null,null,0,null,"","","",""]
[null,null,null,null,null,null,null,null,0,null,"","","",""]
[null,null,null,null,null,null,null,null,0,null,"","","",""]
[null,null,null,null,null,null,null,null,0,null,"","","",""]
[null,null,null,null,null,null,null,null,0,null,"","","",""]
[null,null,null,null,null,null,null,null,0,null,"","","",""]
[null,null,null,null,null,null,null,null,0,null,"","","",""]
[null,null,null,null,null,null,null,null,0,null,"","","",""]
[null,null,null,null,null,null,null,null,0,null,"","","",""]
[null,null,null,null,null,null,null,null,0,null,"","","",""]
[null,null,null,null,null,null,null,null,0,null,"","","",""]
[null,null,null,null,null,null,null,null,0,null,"","","",""]
[null,null,null,null,null,null,null,null,0,null,"","","",""]
[null,null,null,null,null,null,null,null,0,null,"","","",""]
[null,null,null,null,null,null,null,null,0,null,"","","",""]
[null,null,null,null,null,null,null,null,0,null,"","","",""]
[null,null,null,null,null,null,null,null,0,null,"","","",""]
[null,null,null,null,null,null,null,null,0,null,"","","",""]
[null,null,null,null,null,null,null,null,0,null,"","","",""]
[null,null,null,null,null,null,null,null,0,null,"","","",""]
[null,null,null,null,null,null,null,null,0,null,"","","",""]
[null,null,null,null,null,null,null,null,{"$f":"IFERROR(G2954+H2954,\"\")","v":0},null,"","","",""]
[null,null,null,null,null,null,null,null,0,null,"","","",""]
[null,null,null,null,null,null,null,null,0,null,"","","",""]
[null,null,null,null,null,null,null,null,0,null,"","","",""]
[null,null,null,null,null,null,null,null,0,null,"","","",""]
[null,null,null,null,null,null,null,null,0,null,"","","",""]
[null,null,null,null,null,null,null,null,0,null,"","","",""]
[null,null,null,null,null,null,null,null,0,null,"","","",""]
[null,null,null,null,null,null,null,null,0,null,"","","",""]
[null,null,null,null,null,null,null,null,0,null,"","","",""]
[null,null,null,null,null,null,null,null,0,null,"","","",""]
[null,null,null,null,null,null,null,null,0,null,"","","",""]
[null,null,null,null,null,null,null,null,0,null,"","","",""]
[null,null,null,null,null,null,null,null,0,null,"","","",""]
[null,null,null,null,null,null,null,null,0,null,"","","",""]
[null,null,null,null,null,null,null,null,0,null,"","","",""]
[null,null,null,null,null,null,null,null,0,null,"","","",""]
[null,null,null,null,null,null,null,null,0,null,"","","",""]
[null,null,null,null,null,null,null,null,0,null,"","","",""]
[null,null,null,null,null,null,null,null,0,null,"","","",""]
[null,null,null,null,null,null,null,null,0,null,"","","",""]
[null,null,null,null,null,null,null,null,0,null,"","","",""]
[null,null,null,null,null,null,null,null,0,null,"","","",""]
[null,null,null,null,null,null,null,null,0,null,"","","",""]
[null,null,null,null,null,null,null,null,0,null,"","","",""]
[null,null,null,null,null,null,null,null,0,null,"","","",""]
[null,null,null,null,null,null,null,null,0,null,"","","",""]
[null,null,null,null,null,null,null,null,0,null,"","","",""]
[null,null,null,null,null,null,null,null,0,null,"","","",""]
[null,null,null,null,null,null,null,null,0,null,{"$f":"IFERROR(IF(J2983<>\"\",F2983*J2983,\"\"),\"\")","v":""},{"$f":"IFERROR(IF(J2983<>\"\",G2983*J2983,\"\"),\"\")","v":""},{"$f":"IFERROR(IF(J2983<>\"\",H2983*J2983,\"\"),\"\")","v":""},{"$f":"IFERROR(L2983+M2983,\"\")","v":""}]
[null,null,null,null,null,null,null,null,0,null,"","","",""]
[null,null,null,null,null,null,null,null,0,null,"","","",""]
[null,null,null,null,null,null,null,null,0,null,"","","",""]
[null,null,null,null,null,null,null,null,0,null,"","","",""]
[null,null,null,null,null,null,null,null,0,null,"","","",""]
[null,null,null,null,null,null,null,null,0,null,"","","",""]
[null,null,null,null,null,null,null,null,0,null,"","","",""]
[null,null,null,null,null,null,null,null,0,null,"","","",""]
[null,null,null,null,null,null,null,null,0,null,"","","",""]
[null,null,null,null,null,null,null,null,0,null,"","","",""]
[null,null,null,null,null,null,null,null,0,null,"","","",""]
[null,null,null,null,null,null,null,null,0,null,"","","",""]
[null,null,null,null,null,null,null,null,0,null,"","","",""]
[null,null,null,null,null,null,null,null,0,null,"","","",""]
[null,null,null,null,null,null,null,null,0,null,"","","",""]
[null,null,null,null,null,null,null,null,0,null,"","","",""]
[null,null,null,null,null,null,null,null,0,null,"","","",""]
[null,null,null,null,null,null,null,null,0,null,"","","",""]
[null,null,null,null,null,null,null,null,0,null,"","","",""]
[null,null,null,null,null,null,null,null,0,null,"","","",""]
[null,null,null,null,null,null,null,null,0,null,"","","",""]
[null,null,null,null,null,null,null,null,0,null,"","","",""]
[null,null,null,null,null,null,null,null,0,null,"","","",""]
[null,null,null,null,null,null,null,null,0,null,"","","",""]
[null,null,null,null,null,null,null,null,0,null,"","","",""]
[null,null,null,null,null,null,null,null,0,null,"","","",""]
[null,null,null,null,null,null,null,null,0,null,"","","",""]
[null,null,null,null,null,null,null,null,0,null,"","","",""]
[null,null,null,null,null,null,null,null,0,null,"","","",""]
[null,null,null,null,null,null,null,null,0,null,"","","",""]
[null,null,null,null,null,null,null,null,0,null,"","","",""]
[null,null,null,null,null,null,null,null,0,null,"","","",""]
[null,null,null,null,null,null,null,null,0,null,"","","",""]
[null,null,null,null,null,null,null,null,0,null,"","","",""]
[null,null,null,null,null,null,null,null,{"$f":"IFERROR(G3018+H3018,\"\")","v":0},null,"","","",""]
[null,null,null,null,null,null,null,null,0,null,"","","",""]
[null,null,null,null,null,null,null,null,0,null,"","","",""]
[null,null,null,null,null,null,null,null,0,null,"","","",""]
[null,null,null,null,null,null,null,null,0,null,"","","",""]
[null,null,null,null,null,null,null,null,0,null,"","","",""]
[null,null,null,null,null,null,null,null,0,null,"","","",""]
[null,null,null,null,null,null,null,null,0,null,"","","",""]
[null,null,null,null,null,null,null,null,0,null,"","","",""]
[null,null,null,null,null,null,null,null,0,null,"","","",""]
[null,null,null,null,null,null,null,null,0,null,"","","",""]
[null,null,null,null,null,null,null,null,0,null,"","","",""]
[null,null,null,null,null,null,null,null,0,null,"","","",""]
[null,null,null,null,null,null,null,null,0,null,"","","",""]
[null,null,null,null,null,null,null,null,0,null,"","","",""]
[null,null,null,null,null,null,null,null,0,null,"","","",""]
[null,null,null,null,null,null,null,null,0,null,"","","",""]
[null,null,null,null,null,null,null,null,0,null,"","","",""]
[null,null,null,null,null,null,null,null,0,null,"","","",""]
[null,null,null,null,null,null,null,null,0,null,"","","",""]
[null,null,null,null,null,null,null,null,0,null,"","","",""]
[null,null,null,null,null,null,null,null,0,null,"","","",""]
[null,null,null,null,null,null,null,null,0,null,"","","",""]
[null,null,null,null,null,null,null,null,0,null,"","","",""]
[null,null,null,null,null,null,null,null,0,null,"","","",""]
[null,null,null,null,null,null,null,null,0,null,"","","",""]
[null,null,null,null,null,null,null,null,0,null,"","","",""]
[null,null,null,null,null,null,null,null,0,null,"","","",""]
[null,null,null,null,null,null,null,null,0,null,"","","",""]
[null,null,null,null,null,null,null,null,0,null,{"$f":"IFERROR(IF(J3047<>\"\",F3047*J3047,\"\"),\"\")","v":""},{"$f":"IFERROR(IF(J3047<>\"\",G3047*J3047,\"\"),\"\")","v":""},{"$f":"IFERROR(IF(J3047<>\"\",H3047*J3047,\"\"),\"\")","v":""},{"$f":"IFERROR(L3047+M3047,\"\")","v":""}]
[null,null,null,null,null,null,null,null,0,null,"","","",""]
[null,null,null,null,null,null,null,null,0,null,"","","",""]
[null,null,null,null,null,null,null,null,0,null,"","","",""]
[null,null,null,null,null,null,null,null,0,null,"","","",""]
[null,null,null,null,null,null,null,null,0,null,"","","",""]
[null,null,null,null,null,null,null,null,0,null,"","","",""]
[null,null,null,null,null,null,null,null,0,null,"","","",""]
[null,null,null,null,null,null,null,null,0,null,"","","",""]
[null,null,null,null,null,null,null,null,0,null,"","","",""]
[null,null,null,null,null,null,null,null,0,null,"","","",""]
[null,null,null,null,null,null,null,null,0,null,"","","",""]
[null,null,null,null,null,null,null,null,0,null,"","","",""]
[null,null,null,null,null,null,null,null,0,null,"","","",""]
[null,null,null,null,null,null,null,null,0,null,"","","",""]
[null,null,null,null,null,null,null,null,0,null,"","","",""]
[null,null,null,null,null,null,null,null,0,null,"","","",""]
[null,null,null,null,null,null,null,null,0,null,"","","",""]
[null,null,null,null,null,null,null,null,0,null,"","","",""]
[null,null,null,null,null,null,null,null,0,null,"","","",""]
[null,null,null,null,null,null,null,null,0,null,"","","",""]
[null,null,null,null,null,null,null,null,0,null,"","","",""]
[null,null,null,null,null,null,null,null,0,null,"","","",""]
[null,null,null,null,null,null,null,null,0,null,"","","",""]
[null,null,null,null,null,null,null,null,0,null,"","","",""]
[null,null,null,null,null,null,null,null,0,null,"","","",""]
[null,null,null,null,null,null,null,null,0,null,"","","",""]
[null,null,null,null,null,null,null,null,0,null,"","","",""]
[null,null,null,null,null,null,null,null,0,null,"","","",""]
[null,null,null,null,null,null,null,null,0,null,"","","",""]
[null,null,null,null,null,null,null,null,0,null,"","","",""]
[null,null,null,null,null,null,null,null,0,null,"","","",""]
[null,null,null,null,null,null,null,null,0,null,"","","",""]
[null,null,null,null,null,null,null,null,0,null,"","","",""]
[null,null,null,null,null,null,null,null,0,null,"","","",""]
[null,null,null,null,null,null,null,null,{"$f":"IFERROR(G3082+H3082,\"\")","v":0},null,"","","",""]
[null,null,null,null,null,null,null,null,0,null,"","","",""]
[null,null,null,null,null,null,null,null,0,null,"","","",""]
[null,null,null,null,null,null,null,null,0,null,"","","",""]
[null,null,null,null,null,null,null,null,0,null,"","","",""]
[null,null,null,null,null,null,null,null,0,null,"","","",""]
[null,null,null,null,null,null,null,null,0,null,"","","",""]
[null,null,null,null,null,null,null,null,0,null,"","","",""]
[null,null,null,null,null,null,null,null,0,null,"","","",""]
[null,null,null,null,null,null,null,null,0,null,"","","",""]
[null,null,null,null,null,null,null,null,0,null,"","","",""]
[null,null,null,null,null,null,null,null,0,null,"","","",""]
[null,null,null,null,null,null,null,null,0,null,"","","",""]
[null,null,null,null,null,null,null,null,0,null,"","","",""]
[null,null,null,null,null,null,null,null,0,null,"","","",""]
[null,null,null,null,null,null,null,null,0,null,"","","",""]
[null,null,null,null,null,null,null,null,0,null,"","","",""]
[null,null,null,null,null,null,null,null,0,null,"","","",""]
[null,null,null,null,null,null,null,null,0,null,"","","",""]
[null,null,null,null,null,null,null,null,0,null,"","","",""]
[null,null,null,null,null,null,null,null,0,null,"","","",""]
[null,null,null,null,null,null,null,null,0,null,"","","",""]
[null,null,null,null,null,null,null,null,0,null,"","","",""]
[null,null,null,null,null,null,null,null,0,null,"","","",""]
[null,null,null,null,null,null,null,null,0,null,"","","",""]
[null,null,null,null,null,null,null,null,0,null,"","","",""]
[null,null,null,null,null,null,null,null,0,null,"","","",""]
[null,null,null,null,null,null,null,null,0,null,"","","",""]
[null,null,null,null,null,null,null,null,0,null,"","","",""]
[null,null,null,null,null,null,null,null,0,null,{"$f":"IFERROR(IF(J3111<>\"\",F3111*J3111,\"\"),\"\")","v":""},{"$f":"IFERROR(IF(J3111<>\"\",G3111*J3111,\"\"),\"\")","v":""},{"$f":"IFERROR(IF(J3111<>\"\",H3111*J3111,\"\"),\"\")","v":""},{"$f":"IFERROR(L3111+M3111,\"\")","v":""}]
[null,null,null,null,null,null,null,null,0,null,"","","",""]
[null,null,null,null,null,null,null,null,0,null,"","","",""]
[null,null,null,null,null,null,null,null,0,null,"","","",""]
[null,null,null,null,null,null,null,null,0,null,"","","",""]
[null,null,null,null,null,null,null,null,0,null,"","","",""]
[null,null,null,null,null,null,null,null,0,null,"","","",""]
[null,null,null,null,null,null,null,null,0,null,"","","",""]
[null,null,null,null,null,null,null,null,0,null,"","","",""]
[null,null,null,null,null,null,null,null,0,null,"","","",""]
[null,null,null,null,null,null,null,null,0,null,"","","",""]
[null,null,null,null,null,null,null,null,0,null,"","","",""]
[null,null,null,null,null,null,null,null,0,null,"","","",""]
[null,null,null,null,null,null,null,null,0,null,"","","",""]
[null,null,null,null,null,null,null,null,0,null,"","","",""]
[null,null,null,null,null,null,null,null,0,null,"","","",""]
[null,null,null,null,null,null,null,null,0,null,"","","",""]
[null,null,null,null,null,null,null,null,0,null,"","","",""]
[null,null,null,null,null,null,null,null,0,null,"","","",""]
[null,null,null,null,null,null,null,null,0,null,"","","",""]
[null,null,null,null,null,null,null,null,0,null,"","","",""]
[null,null,null,null,null,null,null,null,0,null,"","","",""]
[null,null,null,null,null,null,null,null,0,null,"","","",""]
[null,null,null,null,null,null,null,null,0,null,"","","",""]
[null,null,null,null,null,null,null,null,0,null,"","","",""]
[null,null,null,null,null,null,null,null,0,null,"","","",""]
[null,null,null,null,null,null,null,null,0,null,"","","",""]
[null,null,null,null,null,null,null,null,0,null,"","","",""]
[null,null,null,null,null,null,null,null,0,null,"","","",""]
[null,null,null,null,null,null,null,null,0,null,"","","",""]
[null,null,null,null,null,null,null,null,0,null,"","","",""]
[null,null,null,null,null,null,null,null,0,null,"","","",""]
[null,null,null,null,null,null,null,null,0,null,"","","",""]
[null,null,null,null,null,null,null,null,0,null,"","","",""]
[null,null,null,null,null,null,null,null,0,null,"","","",""]
[null,null,null,null,null,null,null,null,{"$f":"IFERROR(G3146+H3146,\"\")","v":0},null,"","","",""]
[null,null,null,null,null,null,null,null,0,null,"","","",""]
[null,null,null,null,null,null,null,null,0,null,"","","",""]
[null,null,null,null,null,null,null,null,0,null,"","","",""]
[null,null,null,null,null,null,null,null,0,null,"","","",""]
[null,null,null,null,null,null,null,null,0,null,"","","",""]
[null,null,null,null,null,null,null,null,0,null,"","","",""]
[null,null,null,null,null,null,null,null,0,null,"","","",""]
[null,null,null,null,null,null,null,null,0,null,"","","",""]
[null,null,null,null,null,null,null,null,0,null,"","","",""]
[null,null,null,null,null,null,null,null,0,null,"","","",""]
[null,null,null,null,null,null,null,null,0,null,"","","",""]
[null,null,null,null,null,null,null,null,0,null,"","","",""]
[null,null,null,null,null,null,null,null,0,null,"","","",""]
[null,null,null,null,null,null,null,null,0,null,"","","",""]
[null,null,null,null,null,null,null,null,0,null,"","","",""]
[null,null,null,null,null,null,null,null,0,null,"","","",""]
[null,null,null,null,null,null,null,null,0,null,"","","",""]
[null,null,null,null,null,null,null,null,0,null,"","","",""]
[null,null,null,null,null,null,null,null,0,null,"","","",""]
[null,null,null,null,null,null,null,null,0,null,"","","",""]
[null,null,null,null,null,null,null,null,0,null,"","","",""]
[null,null,null,null,null,null,null,null,0,null,"","","",""]
[null,null,null,null,null,null,null,null,0,null,"","","",""]
[null,null,null,null,null,null,null,null,0,null,"","","",""]
[null,null,null,null,null,null,null,null,0,null,"","","",""]
[null,null,null,null,null,null,null,null,0,null,"","","",""]
[null,null,null,null,null,null,null,null,0,null,"","","",""]
[null,null,null,null,null,null,null,null,0,null,"","","",""]
[null,null,null,null,null,null,null,null,0,null,{"$f":"IFERROR(IF(J3175<>\"\",F3175*J3175,\"\"),\"\")","v":""},{"$f":"IFERROR(IF(J3175<>\"\",G3175*J3175,\"\"),\"\")","v":""},{"$f":"IFERROR(IF(J3175<>\"\",H3175*J3175,\"\"),\"\")","v":""},{"$f":"IFERROR(L3175+M3175,\"\")","v":""}]
[null,null,null,null,null,null,null,null,0,null,"","","",""]
[null,null,null,null,null,null,null,null,0,null,"","","",""]
[null,null,null,null,null,null,null,null,0,null,"","","",""]
[null,null,null,null,null,null,null,null,0,null,"","","",""]
[null,null,null,null,null,null,null,null,0,null,"","","",""]
[null,null,null,null,null,null,null,null,0,null,"","","",""]
[null,null,null,null,null,null,null,null,0,null,"","","",""]
[null,null,null,null,null,null,null,null,0,null,"","","",""]
[null,null,null,null,null,null,null,null,0,null,"","","",""]
[null,null,null,null,null,null,null,null,0,null,"","","",""]
[null,null,null,null,null,null,null,null,0,null,"","","",""]
[null,null,null,null,null,null,null,null,0,null,"","","",""]
[null,null,null,null,null,null,null,null,0,null,"","","",""]
[null,null,null,null,null,null,null,null,0,null,"","","",""]
[null,null,null,null,null,null,null,null,0,null,"","","",""]
[null,null,null,null,null,null,null,null,0,null,"","","",""]
[null,null,null,null,null,null,null,null,0,null,"","","",""]
[null,null,null,null,null,null,null,null,0,null,"","","",""]
[null,null,null,null,null,null,null,null,0,null,"","","",""]
[null,null,null,null,null,null,null,null,0,null,"","","",""]
[null,null,null,null,null,null,null,null,0,null,"","","",""]
[null,null,null,null,null,null,null,null,0,null,"","","",""]
[null,null,null,null,null,null,null,null,0,null,"","","",""]
[null,null,null,null,null,null,null,null,0,null,"","","",""]
[null,null,null,null,null,null,null,null,0,null,"","","",""]
[null,null,null,null,null,null,null,null,0,null,"","","",""]
[null,null,null,null,null,null,null,null,0,null,"","","",""]
[null,null,null,null,null,null,null,null,0,null,"","","",""]
[null,null,null,null,null,null,null,null,0,null,"","","",""]
[null,null,null,null,null,null,null,null,0,null,"","","",""]
[null,null,null,null,null,null,null,null,0,null,"","","",""]
[null,null,null,null,null,null,null,null,0,null,"","","",""]
[null,null,null,null,null,null,null,null,0,null,"","","",""]
[null,null,null,null,null,null,null,null,0,null,"","","",""]
[null,null,null,null,null,null,null,null,{"$f":"IFERROR(G3210+H3210,\"\")","v":0},null,"","","",""]
[null,null,null,null,null,null,null,null,0,null,"","","",""]
[null,null,null,null,null,null,null,null,0,null,"","","",""]
[null,null,null,null,null,null,null,null,0,null,"","","",""]
[null,null,null,null,null,null,null,null,0,null,"","","",""]
[null,null,null,null,null,null,null,null,0,null,"","","",""]
[null,null,null,null,null,null,null,null,0,null,"","","",""]
[null,null,null,null,null,null,null,null,0,null,"","","",""]
[null,null,null,null,null,null,null,null,0,null,"","","",""]
[null,null,null,null,null,null,null,null,0,null,"","","",""]
[null,null,null,null,null,null,null,null,0,null,"","","",""]
[null,null,null,null,null,null,null,null,0,null,"","","",""]
[null,null,null,null,null,null,null,null,0,null,"","","",""]
[null,null,null,null,null,null,null,null,0,null,"","","",""]
[null,null,null,null,null,null,null,null,0,null,"","","",""]
[null,null,null,null,null,null,null,null,0,null,"","","",""]
[null,null,null,null,null,null,null,null,0,null,"","","",""]
[null,null,null,null,null,null,null,null,0,null,"","","",""]
[null,null,null,null,null,null,null,null,0,null,"","","",""]
[null,null,null,null,null,null,null,null,0,null,"","","",""]
[null,null,null,null,null,null,null,null,0,null,"","","",""]
[null,null,null,null,null,null,null,null,0,null,"","","",""]
[null,null,null,null,null,null,null,null,0,null,"","","",""]
[null,null,null,null,null,null,null,null,0,null,"","","",""]
[null,null,null,null,null,null,null,null,0,null,"","","",""]
[null,null,null,null,null,null,null,null,0,null,"","","",""]
[null,null,null,null,null,null,null,null,0,null,"","","",""]
[null,null,null,null,null,null,null,null,0,null,"","","",""]
[null,null,null,null,null,null,null,null,0,null,"","","",""]
[null,null,null,null,null,null,null,null,0,null,{"$f":"IFERROR(IF(J3239<>\"\",F3239*J3239,\"\"),\"\")","v":""},{"$f":"IFERROR(IF(J3239<>\"\",G3239*J3239,\"\"),\"\")","v":""},{"$f":"IFERROR(IF(J3239<>\"\",H3239*J3239,\"\"),\"\")","v":""},{"$f":"IFERROR(L3239+M3239,\"\")","v":""}]
[null,null,null,null,null,null,null,null,0,null,"","","",""]
[null,null,null,null,null,null,null,null,0,null,"","","",""]
[null,null,null,null,null,null,null,null,0,null,"","","",""]
[null,null,null,null,null,null,null,null,0,null,"","","",""]
[null,null,null,null,null,null,null,null,0,null,"","","",""]
[null,null,null,null,null,null,null,null,0,null,"","","",""]
[null,null,null,null,null,null,null,null,0,null,"","","",""]
[null,null,null,null,null,null,null,null,0,null,"","","",""]
[null,null,null,null,null,null,null,null,0,null,"","","",""]
[null,null,null,null,null,null,null,null,0,null,"","","",""]
[null,null,null,null,null,null,null,null,0,null,"","","",""]
[null,null,null,null,null,null,null,null,0,null,"","","",""]
[null,null,null,null,null,null,null,null,0,null,"","","",""]
[null,null,null,null,null,null,null,null,0,null,"","","",""]
[null,null,null,null,null,null,null,null,0,null,"","","",""]
[null,null,null,null,null,null,null,null,0,null,"","","",""]
[null,null,null,null,null,null,null,null,0,null,"","","",""]
[null,null,null,null,null,null,null,null,0,null,"","","",""]
[null,null,null,null,null,null,null,null,0,null,"","","",""]
[null,null,null,null,null,null,null,null,0,null,"","","",""]
[null,null,null,null,null,null,null,null,0,null,"","","",""]
[null,null,null,null,null,null,null,null,0,null,"","","",""]
[null,null,null,null,null,null,null,null,0,null,"","","",""]
[null,null,null,null,null,null,null,null,0,null,"","","",""]
[null,null,null,null,null,null,null,null,0,null,"","","",""]
[null,null,null,null,null,null,null,null,0,null,"","","",""]
[null,null,null,null,null,null,null,null,0,null,"","","",""]
[null,null,null,null,null,null,null,null,0,null,"","","",""]
[null,null,null,null,null,null,null,null,0,null,"","","",""]
[null,null,null,null,null,null,null,null,0,null,"","","",""]
[null,null,null,null,null,null,null,null,0,null,"","","",""]
[null,null,null,null,null,null,null,null,0,null,"","","",""]
[null,null,null,null,null,null,null,null,0,null,"","","",""]
[null,null,null,null,null,null,null,null,0,null,"","","",""]
[null,null,null,null,null,null,null,null,{"$f":"IFERROR(G3274+H3274,\"\")","v":0},null,"","","",""]
[null,null,null,null,null,null,null,null,0,null,"","","",""]
[null,null,null,null,null,null,null,null,0,null,"","","",""]
[null,null,null,null,null,null,null,null,0,null,"","","",""]
[null,null,null,null,null,null,null,null,0,null,"","","",""]
[null,null,null,null,null,null,null,null,0,null,"","","",""]
[null,null,null,null,null,null,null,null,0,null,"","","",""]
[null,null,null,null,null,null,null,null,0,null,"","","",""]
[null,null,null,null,null,null,null,null,0,null,"","","",""]
[null,null,null,null,null,null,null,null,0,null,"","","",""]
[null,null,null,null,null,null,null,null,0,null,"","","",""]
[null,null,null,null,null,null,null,null,0,null,"","","",""]
[null,null,null,null,null,null,null,null,0,null,"","","",""]
[null,null,null,null,null,null,null,null,0,null,"","","",""]
[null,null,null,null,null,null,null,null,0,null,"","","",""]
[null,null,null,null,null,null,null,null,0,null,"","","",""]
[null,null,null,null,null,null,null,null,0,null,"","","",""]
[null,null,null,null,null,null,null,null,0,null,"","","",""]
[null,null,null,null,null,null,null,null,0,null,"","","",""]
[null,null,null,null,null,null,null,null,0,null,"","","",""]
[null,null,null,null,null,null,null,null,0,null,"","","",""]
[null,null,null,null,null,null,null,null,0,null,"","","",""]
[null,null,null,null,null,null,null,null,0,null,"","","",""]
[null,null,null,null,null,null,null,null,0,null,"","","",""]
[null,null,null,null,null,null,null,null,0,null,"","","",""]
[null,null,null,null,null,null,null,null,0,null,"","","",""]
[null,null,null,null,null,null,null,null,0,null,"","","",""]
[null,null,null,null,null,null,null,null,0,null,"","","",""]
[null,null,null,null,null,null,null,null,0,null,"","","",""]
[null,null,null,null,null,null,null,null,0,null,{"$f":"IFERROR(IF(J3303<>\"\",F3303*J3303,\"\"),\"\")","v":""},{"$f":"IFERROR(IF(J3303<>\"\",G3303*J3303,\"\"),\"\")","v":""},{"$f":"IFERROR(IF(J3303<>\"\",H3303*J3303,\"\"),\"\")","v":""},{"$f":"IFERROR(L3303+M3303,\"\")","v":""}]
[null,null,null,null,null,null,null,null,0,null,"","","",""]
[null,null,null,null,null,null,null,null,0,null,"","","",""]
[null,null,null,null,null,null,null,null,0,null,"","","",""]
[null,null,null,null,null,null,null,null,0,null,"","","",""]
[null,null,null,null,null,null,null,null,0,null,"","","",""]
[null,null,null,null,null,null,null,null,0,null,"","","",""]
[null,null,null,null,null,null,null,null,0,null,"","","",""]
[null,null,null,null,null,null,null,null,0,null,"","","",""]
[null,null,null,null,null,null,null,null,0,null,"","","",""]
[null,null,null,null,null,null,null,null,0,null,"","","",""]
[null,null,null,null,null,null,null,null,0,null,"","","",""]
[null,null,null,null,null,null,null,null,0,null,"","","",""]
[null,null,null,null,null,null,null,null,0,null,"","","",""]
[null,null,null,null,null,null,null,null,0,null,"","","",""]
[null,null,null,null,null,null,null,null,0,null,"","","",""]
[null,null,null,null,null,null,null,null,0,null,"","","",""]
[null,null,null,null,null,null,null,null,0,null,"","","",""]
[null,null,null,null,null,null,null,null,0,null,"","","",""]
[null,null,null,null,null,null,null,null,0,null,"","","",""]
[null,null,null,null,null,null,null,null,0,null,"","","",""]
[null,null,null,null,null,null,null,null,0,null,"","","",""]
[null,null,null,null,null,null,null,null,0,null,"","","",""]
[null,null,null,null,null,null,null,null,0,null,"","","",""]
[null,null,null,null,null,null,null,null,0,null,"","","",""]
[null,null,null,null,null,null,null,null,0,null,"","","",""]
[null,null,null,null,null,null,null,null,0,null,"","","",""]
[null,null,null,null,null,null,null,null,0,null,"","","",""]
[null,null,null,null,null,null,null,null,0,null,"","","",""]
[null,null,null,null,null,null,null,null,0,null,"","","",""]
[null,null,null,null,null,null,null,null,0,null,"","","",""]
[null,null,null,null,null,null,null,null,0,null,"","","",""]
[null,null,null,null,null,null,null,null,0,null,"","","",""]
[null,null,null,null,null,null,null,null,0,null,"","","",""]
[null,null,null,null,null,null,null,null,0,null,"","","",""]
[null,null,null,null,null,null,null,null,{"$f":"IFERROR(G3338+H3338,\"\")","v":0},null,"","","",""]
[null,null,null,null,null,null,null,null,0,null,"","","",""]
[null,null,null,null,null,null,null,null,0,null,"","","",""]
[null,null,null,null,null,null,null,null,0,null,"","","",""]
[null,null,null,null,null,null,null,null,0,null,"","","",""]
[null,null,null,null,null,null,null,null,0,null,"","","",""]
[null,null,null,null,null,null,null,null,0,null,"","","",""]
[null,null,null,null,null,null,null,null,0,null,"","","",""]
[null,null,null,null,null,null,null,null,0,null,"","","",""]
[null,null,null,null,null,null,null,null,0,null,"","","",""]
[null,null,null,null,null,null,null,null,0,null,"","","",""]
[null,null,null,null,null,null,null,null,0,null,"","","",""]
[null,null,null,null,null,null,null,null,0,null,"","","",""]
[null,null,null,null,null,null,null,null,0,null,"","","",""]
[null,null,null,null,null,null,null,null,0,null,"","","",""]
[null,null,null,null,null,null,null,null,0,null,"","","",""]
[null,null,null,null,null,null,null,null,0,null,"","","",""]
[null,null,null,null,null,null,null,null,0,null,"","","",""]
[null,null,null,null,null,null,null,null,0,null,"","","",""]
[null,null,null,null,null,null,null,null,0,null,"","","",""]
[null,null,null,null,null,null,null,null,0,null,"","","",""]
[null,null,null,null,null,null,null,null,0,null,"","","",""]
[null,null,null,null,null,null,null,null,0,null,"","","",""]
[null,null,null,null,null,null,null,null,0,null,"","","",""]
[null,null,null,null,null,null,null,null,0,null,"","","",""]
[null,null,null,null,null,null,null,null,0,null,"","","",""]
[null,null,null,null,null,null,null,null,0,null,"","","",""]
[null,null,null,null,null,null,null,null,0,null,"","","",""]
[null,null,null,null,null,null,null,null,0,null,"","","",""]
[null,null,null,null,null,null,null,null,0,null,{"$f":"IFERROR(IF(J3367<>\"\",F3367*J3367,\"\"),\"\")","v":""},{"$f":"IFERROR(IF(J3367<>\"\",G3367*J3367,\"\"),\"\")","v":""},{"$f":"IFERROR(IF(J3367<>\"\",H3367*J3367,\"\"),\"\")","v":""},{"$f":"IFERROR(L3367+M3367,\"\")","v":""}]
[null,null,null,null,null,null,null,null,0,null,"","","",""]
[null,null,null,null,null,null,null,null,0,null,"","","",""]
[null,null,null,null,null,null,null,null,0,null,"","","",""]
[null,null,null,null,null,null,null,null,0,null,"","","",""]
[null,null,null,null,null,null,null,null,0,null,"","","",""]
[null,null,null,null,null,null,null,null,0,null,"","","",""]
[null,null,null,null,null,null,null,null,0,null,"","","",""]
[null,null,null,null,null,null,null,null,0,null,"","","",""]
[null,null,null,null,null,null,null,null,0,null,"","","",""]
[null,null,null,null,null,null,null,null,0,null,"","","",""]
[null,null,null,null,null,null,null,null,0,null,"","","",""]
[null,null,null,null,null,null,null,null,0,null,"","","",""]
[null,null,null,null,null,null,null,null,0,null,"","","",""]
[null,null,null,null,null,null,null,null,0,null,"","","",""]
[null,null,null,null,null,null,null,null,0,null,"","","",""]
[null,null,null,null,null,null,null,null,0,null,"","","",""]
[null,null,null,null,null,null,null,null,0,null,"","","",""]
[null,null,null,null,null,null,null,null,0,null,"","","",""]
[null,null,null,null,null,null,null,null,0,null,"","","",""]
[null,null,null,null,null,null,null,null,0,null,"","","",""]
[null,null,null,null,null,null,null,null,0,null,"","","",""]
[null,null,null,null,null,null,null,null,0,null,"","","",""]
[null,null,null,null,null,null,null,null,0,null,"","","",""]
[null,null,null,null,null,null,null,null,0,null,"","","",""]
[null,null,null,null,null,null,null,null,0,null,"","","",""]
[null,null,null,null,null,null,null,null,0,null,"","","",""]
[null,null,null,null,null,null,null,null,0,null,"","","",""]
[null,null,null,null,null,null,null,null,0,null,"","","",""]
[null,null,null,null,null,null,null,null,0,null,"","","",""]
[null,null,null,null,null,null,null,null,0,null,"","","",""]
[null,null,null,null,null,null,null,null,0,null,"","","",""]
[null,null,null,null,null,null,null,null,0,null,"","","",""]
[null,null,null,null,null,null,null,null,0,null,"","","",""]
[null,null,null,null,null,null,null,null,0,null,"","","",""]
[null,null,null,null,null,null,null,null,{"$f":"IFERROR(G3402+H3402,\"\")","v":0},null,"","","",""]
[null,null,null,null,null,null,null,null,0,null,"","","",""]
[null,null,null,null,null,null,null,null,0,null,"","","",""]
[null,null,null,null,null,null,null,null,0,null,"","","",""]
[null,null,null,null,null,null,null,null,0,null,"","","",""]
[null,null,null,null,null,null,null,null,0,null,"","","",""]
[null,null,null,null,null,null,null,null,0,null,"","","",""]
[null,null,null,null,null,null,null,null,0,null,"","","",""]
[null,null,null,null,null,null,null,null,0,null,"","","",""]
[null,null,null,null,null,null,null,null,0,null,"","","",""]
[null,null,null,null,null,null,null,null,0,null,"","","",""]
[null,null,null,null,null,null,null,null,0,null,"","","",""]
[null,null,null,null,null,null,null,null,0,null,"","","",""]
[null,null,null,null,null,null,null,null,0,null,"","","",""]
[null,null,null,null,null,null,null,null,0,null,"","","",""]
[null,null,null,null,null,null,null,null,0,null,"","","",""]
[null,null,null,null,null,null,null,null,0,null,"","","",""]
[null,null,null,null,null,null,null,null,0,null,"","","",""]
[null,null,null,null,null,null,null,null,0,null,"","","",""]
[null,null,null,null,null,null,null,null,0,null,"","","",""]
[null,null,null,null,null,null,null,null,0,null,"","","",""]
[null,null,null,null,null,null,null,null,0,null,"","","",""]
[null,null,null,null,null,null,null,null,0,null,"","","",""]
[null,null,null,null,null,null,null,null,0,null,"","","",""]
[null,null,null,null,null,null,null,null,0,null,"","","",""]
[null,null,null,null,null,null,null,null,0,null,"","","",""]
[null,null,null,null,null,null,null,null,0,null,"","","",""]
[null,null,null,null,null,null,null,null,0,null,"","","",""]
[null,null,null,null,null,null,null,null,0,null,"","","",""]
[null,null,null,null,null,null,null,null,0,null,{"$f":"IFERROR(IF(J3431<>\"\",F3431*J3431,\"\"),\"\")","v":""},{"$f":"IFERROR(IF(J3431<>\"\",G3431*J3431,\"\"),\"\")","v":""},{"$f":"IFERROR(IF(J3431<>\"\",H3431*J3431,\"\"),\"\")","v":""},{"$f":"IFERROR(L3431+M3431,\"\")","v":""}]
[null,null,null,null,null,null,null,null,0,null,"","","",""]
[null,null,null,null,null,null,null,null,0,null,"","","",""]
[null,null,null,null,null,null,null,null,0,null,"","","",""]
[null,null,null,null,null,null,null,null,0,null,"","","",""]
[null,null,null,null,null,null,null,null,0,null,"","","",""]
[null,null,null,null,null,null,null,null,0,null,"","","",""]
[null,null,null,null,null,null,null,null,0,null,"","","",""]
[null,null,null,null,null,null,null,null,0,null,"","","",""]
[null,null,null,null,null,null,null,null,0,null,"","","",""]
[null,null,null,null,null,null,null,null,0,null,"","","",""]
[null,null,null,null,null,null,null,null,0,null,"","","",""]
[null,null,null,null,null,null,null,null,0,null,"","","",""]
[null,null,null,null,null,null,null,null,0,null,"","","",""]
[null,null,null,null,null,null,null,null,0,null,"","","",""]
[null,null,null,null,null,null,null,null,0,null,"","","",""]
[null,null,null,null,null,null,null,null,0,null,"","","",""]
[null,null,null,null,null,null,null,null,0,null,"","","",""]
[null,null,null,null,null,null,null,null,0,null,"","","",""]
[null,null,null,null,null,null,null,null,0,null,"","","",""]
[null,null,null,null,null,null,null,null,0,null,"","","",""]
[null,null,null,null,null,null,null,null,0,null,"","","",""]
[null,null,null,null,null,null,null,null,0,null,"","","",""]
[null,null,null,null,null,null,null,null,0,null,"","","",""]
[null,null,null,null,null,null,null,null,0,null,"","","",""]
[null,null,null,null,null,null,null,null,0,null,"","","",""]
[null,null,null,null,null,null,null,null,0,null,"","","",""]
[null,null,null,null,null,null,null,null,0,null,"","","",""]
[null,null,null,null,null,null,null,null,0,null,"","","",""]
[null,null,null,null,null,null,null,null,0,null,"","","",""]
[null,null,null,null,null,null,null,null,0,null,"","","",""]
[null,null,null,null,null,null,null,null,0,null,"","","",""]
[null,null,null,null,null,null,null,null,0,null,"","","",""]
[null,null,null,null,null,null,null,null,0,null,"","","",""]
[null,null,null,null,null,null,null,null,0,null,"","","",""]
[null,null,null,null,null,null,null,null,{"$f":"IFERROR(G3466+H3466,\"\")","v":0},null,"","","",""]
[null,null,null,null,null,null,null,null,0,null,"","","",""]
[null,null,null,null,null,null,null,null,0,null,"","","",""]
[null,null,null,null,null,null,null,null,0,null,"","","",""]
[null,null,null,null,null,null,null,null,0,null,"","","",""]
[null,null,null,null,null,null,null,null,0,null,"","","",""]
[null,null,null,null,null,null,null,null,0,null,"","","",""]
[null,null,null,null,null,null,null,null,0,null,"","","",""]
[null,null,null,null,null,null,null,null,0,null,"","","",""]
[null,null,null,null,null,null,null,null,0,null,"","","",""]
[null,null,null,null,null,null,null,null,0,null,"","","",""]
[null,null,null,null,null,null,null,null,0,null,"","","",""]
[null,null,null,null,null,null,null,null,0,null,"","","",""]
[null,null,null,null,null,null,null,null,0,null,"","","",""]
[null,null,null,null,null,null,null,null,0,null,"","","",""]
[null,null,null,null,null,null,null,null,0,null,"","","",""]
[null,null,null,null,null,null,null,null,0,null,"","","",""]
[null,null,null,null,null,null,null,null,0,null,"","","",""]
[null,null,null,null,null,null,null,null,0,null,"","","",""]
[null,null,null,null,null,null,null,null,0,null,"","","",""]
[null,null,null,null,null,null,null,null,0,null,"","","",""]
[null,null,null,null,null,null,null,null,0,null,"","","",""]
[null,null,null,null,null,null,null,null,0,null,"","","",""]
[null,null,null,null,null,null,null,null,0,null,"","","",""]
[null,null,null,null,null,null,null,null,0,null,"","","",""]
[null,null,null,null,null,null,null,null,0,null,"","","",""]
[null,null,null,null,null,null,null,null,0,null,"","","",""]
[null,null,null,null,null,null,null,null,0,null,"","","",""]
[null,null,null,null,null,null,null,null,0,null,"","","",""]
[null,null,null,null,null,null,null,null,0,null,{"$f":"IFERROR(IF(J3495<>\"\",F3495*J3495,\"\"),\"\")","v":""},{"$f":"IFERROR(IF(J3495<>\"\",G3495*J3495,\"\"),\"\")","v":""},{"$f":"IFERROR(IF(J3495<>\"\",H3495*J3495,\"\"),\"\")","v":""},{"$f":"IFERROR(L3495+M3495,\"\")","v":""}]
[null,null,null,null,null,null,null,null,0,null,"","","",""]
[null,null,null,null,null,null,null,null,0,null,"","","",""]
[null,null,null,null,null,null,null,null,0,null,"","","",""]
[null,null,null,null,null,null,null,null,0,null,"","","",""]
[null,null,null,null,null,null,null,null,0,null,"","","",""]
[null,null,null,null,null,null,null,null,0,null,"","","",""]
[null,null,null,null,null,null,null,null,0,null,"","","",""]
[null,null,null,null,null,null,null,null,0,null,"","","",""]
[null,null,null,null,null,null,null,null,0,null,"","","",""]
[null,null,null,null,null,null,null,null,0,null,"","","",""]
[null,null,null,null,null,null,null,null,0,null,"","","",""]
[null,null,null,null,null,null,null,null,0,null,"","","",""]
[null,null,null,null,null,null,null,null,0,null,"","","",""]
[null,null,null,null,null,null,null,null,0,null,"","","",""]
[null,null,null,null,null,null,null,null,0,null,"","","",""]
[null,null,null,null,null,null,null,null,0,null,"","","",""]
[null,null,null,null,null,null,null,null,0,null,"","","",""]
[null,null,null,null,null,null,null,null,0,null,"","","",""]
[null,null,null,null,null,null,null,null,0,null,"","","",""]
[null,null,null,null,null,null,null,null,0,null,"","","",""]
[null,null,null,null,null,null,null,null,0,null,"","","",""]
[null,null,null,null,null,null,null,null,0,null,"","","",""]
[null,null,null,null,null,null,null,null,0,null,"","","",""]
[null,null,null,null,null,null,null,null,0,null,"","","",""]
[null,null,null,null,null,null,null,null,0,null,"","","",""]
[null,null,null,null,null,null,null,null,0,null,"","","",""]
[null,null,null,null,null,null,null,null,0,null,"","","",""]
[null,null,null,null,null,null,null,null,0,null,"","","",""]
[null,null,null,null,null,null,null,null,0,null,"","","",""]
[null,null,null,null,null,null,null,null,0,null,"","","",""]
[null,null,null,null,null,null,null,null,0,null,"","","",""]
[null,null,null,null,null,null,null,null,0,null,"","","",""]
[null,null,null,null,null,null,null,null,0,null,"","","",""]
[null,null,null,null,null,null,null,null,0,null,"","","",""]
[null,null,null,null,null,null,null,null,{"$f":"IFERROR(G3530+H3530,\"\")","v":0},null,"","","",""]
[null,null,null,null,null,null,null,null,0,null,"","","",""]
[null,null,null,null,null,null,null,null,0,null,"","","",""]
[null,null,null,null,null,null,null,null,0,null,"","","",""]
[null,null,null,null,null,null,null,null,0,null,"","","",""]
[null,null,null,null,null,null,null,null,0,null,"","","",""]
[null,null,null,null,null,null,null,null,0,null,"","","",""]
[null,null,null,null,null,null,null,null,0,null,"","","",""]
[null,null,null,null,null,null,null,null,0,null,"","","",""]
[null,null,null,null,null,null,null,null,0,null,"","","",""]
[null,null,null,null,null,null,null,null,0,null,"","","",""]
[null,null,null,null,null,null,null,null,0,null,"","","",""]
[null,null,null,null,null,null,null,null,0,null,"","","",""]
[null,null,null,null,null,null,null,null,0,null,"","","",""]
[null,null,null,null,null,null,null,null,0,null,"","","",""]
[null,null,null,null,null,null,null,null,0,null,"","","",""]
[null,null,null,null,null,null,null,null,0,null,"","","",""]
[null,null,null,null,null,null,null,null,0,null,"","","",""]
[null,null,null,null,null,null,null,null,0,null,"","","",""]
[null,null,null,null,null,null,null,null,0,null,"","","",""]
[null,null,null,null,null,null,null,null,0,null,"","","",""]
[null,null,null,null,null,null,null,null,0,null,"","","",""]
[null,null,null,null,null,null,null,null,0,null,"","","",""]
[null,null,null,null,null,null,null,null,0,null,"","","",""]
[null,null,null,null,null,null,null,null,0,null,"","","",""]
[null,null,null,null,null,null,null,null,0,null,"","","",""]
[null,null,null,null,null,null,null,null,0,null,"","","",""]
[null,null,null,null,null,null,null,null,0,null,"","","",""]
[null,null,null,null,null,null,null,null,0,null,"","","",""]
[null,null,null,null,null,null,null,null,0,null,{"$f":"IFERROR(IF(J3559<>\"\",F3559*J3559,\"\"),\"\")","v":""},{"$f":"IFERROR(IF(J3559<>\"\",G3559*J3559,\"\"),\"\")","v":""},{"$f":"IFERROR(IF(J3559<>\"\",H3559*J3559,\"\"),\"\")","v":""},{"$f":"IFERROR(L3559+M3559,\"\")","v":""}]
[null,null,null,null,null,null,null,null,0,null,"","","",""]
[null,null,null,null,null,null,null,null,0,null,"","","",""]
[null,null,null,null,null,null,null,null,0,null,"","","",""]
[null,null,null,null,null,null,null,null,0,null,"","","",""]
[null,null,null,null,null,null,null,null,0,null,"","","",""]
[null,null,null,null,null,null,null,null,0,null,"","","",""]
[null,null,null,null,null,null,null,null,0,null,"","","",""]
[null,null,null,null,null,null,null,null,0,null,"","","",""]
[null,null,null,null,null,null,null,null,0,null,"","","",""]
[null,null,null,null,null,null,null,null,0,null,"","","",""]
[null,null,null,null,null,null,null,null,0,null,"","","",""]
[null,null,null,null,null,null,null,null,0,null,"","","",""]
[null,null,null,null,null,null,null,null,0,null,"","","",""]
[null,null,null,null,null,null,null,null,0,null,"","","",""]
[null,null,null,null,null,null,null,null,0,null,"","","",""]
[null,null,null,null,null,null,null,null,0,null,"","","",""]
[null,null,null,null,null,null,null,null,0,null,"","","",""]
[null,null,null,null,null,null,null,null,0,null,"","","",""]
[null,null,null,null,null,null,null,null,0,null,"","","",""]
[null,null,null,null,null,null,null,null,0,null,"","","",""]
[null,null,null,null,null,null,null,null,0,null,"","","",""]
[null,null,null,null,null,null,null,null,0,null,"","","",""]
[null,null,null,null,null,null,null,null,0,null,"","","",""]
[null,null,null,null,null,null,null,null,0,null,"","","",""]
[null,null,null,null,null,null,null,null,0,null,"","","",""]
[null,null,null,null,null,null,null,null,0,null,"","","",""]
[null,null,null,null,null,null,null,null,0,null,"","","",""]
[null,null,null,null,null,null,null,null,0,null,"","","",""]
[null,null,null,null,null,null,null,null,0,null,"","","",""]
[null,null,null,null,null,null,null,null,0,null,"","","",""]
[null,null,null,null,null,null,null,null,0,null,"","","",""]
[null,null,null,null,null,null,null,null,0,null,"","","",""]
[null,null,null,null,null,null,null,null,0,null,"","","",""]
[null,null,null,null,null,null,null,null,0,null,"","","",""]
[null,null,null,null,null,null,null,null,{"$f":"IFERROR(G3594+H3594,\"\")","v":0},null,"","","",""]
[null,null,null,null,null,null,null,null,0,null,"","","",""]
[null,null,null,null,null,null,null,null,0,null,"","","",""]
[null,null,null,null,null,null,null,null,0,null,"","","",""]
[null,null,null,null,null,null,null,null,0,null,"","","",""]
[null,null,null,null,null,null,null,null,0,null,"","","",""]
[null,null,null,null,null,null,null,null,0,null,"","","",""]
[null,null,null,null,null,null,null,null,0,null,"","","",""]
[null,null,null,null,null,null,null,null,0,null,"","","",""]
[null,null,null,null,null,null,null,null,0,null,"","","",""]
[null,null,null,null,null,null,null,null,0,null,"","","",""]
[null,null,null,null,null,null,null,null,0,null,"","","",""]
[null,null,null,null,null,null,null,null,0,null,"","","",""]
[null,null,null,null,null,null,null,null,0,null,"","","",""]
[null,null,null,null,null,null,null,null,0,null,"","","",""]
[null,null,null,null,null,null,null,null,0,null,"","","",""]
[null,null,null,null,null,null,null,null,0,null,"","","",""]
[null,null,null,null,null,null,null,null,0,null,"","","",""]
[null,null,null,null,null,null,null,null,0,null,"","","",""]
[null,null,null,null,null,null,null,null,0,null,"","","",""]
[null,null,null,null,null,null,null,null,0,null,"","","",""]
[null,null,null,null,null,null,null,null,0,null,"","","",""]
[null,null,null,null,null,null,null,null,0,null,"","","",""]
[null,null,null,null,null,null,null,null,0,null,"","","",""]
[null,null,null,null,null,null,null,null,0,null,"","","",""]
[null,null,null,null,null,null,null,null,0,null,"","","",""]
[null,null,null,null,null,null,null,null,0,null,"","","",""]
[null,null,null,null,null,null,null,null,0,null,"","","",""]
[null,null,null,null,null,null,null,null,0,null,"","","",""]
[null,null,null,null,null,null,null,null,0,null,{"$f":"IFERROR(IF(J3623<>\"\",F3623*J3623,\"\"),\"\")","v":""},{"$f":"IFERROR(IF(J3623<>\"\",G3623*J3623,\"\"),\"\")","v":""},{"$f":"IFERROR(IF(J3623<>\"\",H3623*J3623,\"\"),\"\")","v":""},{"$f":"IFERROR(L3623+M3623,\"\")","v":""}]
[null,null,null,null,null,null,null,null,0,null,"","","",""]
[null,null,null,null,null,null,null,null,0,null,"","","",""]
[null,null,null,null,null,null,null,null,0,null,"","","",""]
[null,null,null,null,null,null,null,null,0,null,"","","",""]
[null,null,null,null,null,null,null,null,0,null,"","","",""]
[null,null,null,null,null,null,null,null,0,null,"","","",""]
[null,null,null,null,null,null,null,null,0,null,"","","",""]
[null,null,null,null,null,null,null,null,0,null,"","","",""]
[null,null,null,null,null,null,null,null,0,null,"","","",""]
[null,null,null,null,null,null,null,null,0,null,"","","",""]
[null,null,null,null,null,null,null,null,0,null,"","","",""]
[null,null,null,null,null,null,null,null,0,null,"","","",""]
[null,null,null,null,null,null,null,null,0,null,"","","",""]
[null,null,null,null,null,null,null,null,0,null,"","","",""]
[null,null,null,null,null,null,null,null,0,null,"","","",""]
[null,null,null,null,null,null,null,null,0,null,"","","",""]
[null,null,null,null,null,null,null,null,0,null,"","","",""]
[null,null,null,null,null,null,null,null,0,null,"","","",""]
[null,null,null,null,null,null,null,null,0,null,"","","",""]
[null,null,null,null,null,null,null,null,0,null,"","","",""]
[null,null,null,null,null,null,null,null,0,null,"","","",""]
[null,null,null,null,null,null,null,null,0,null,"","","",""]
[null,null,null,null,null,null,null,null,0,null,"","","",""]
[null,null,null,null,null,null,null,null,0,null,"","","",""]
[null,null,null,null,null,null,null,null,0,null,"","","",""]
[null,null,null,null,null,null,null,null,0,null,"","","",""]
[null,null,null,null,null,null,null,null,0,null,"","","",""]
[null,null,null,null,null,null,null,null,0,null,"","","",""]
[null,null,null,null,null,null,null,null,0,null,"","","",""]
[null,null,null,null,null,null,null,null,0,null,"","","",""]
[null,null,null,null,null,null,null,null,0,null,"","","",""]
[null,null,null,null,null,null,null,null,0,null,"","","",""]
[null,null,null,null,null,null,null,null,0,null,"","","",""]
[null,null,null,null,null,null,null,null,0,null,"","","",""]
[null,null,null,null,null,null,null,null,{"$f":"IFERROR(G3658+H3658,\"\")","v":0},null,"","","",""]
[null,null,null,null,null,null,null,null,0,null,"","","",""]
[null,null,null,null,null,null,null,null,0,null,"","","",""]
[null,null,null,null,null,null,null,null,0,null,"","","",""]
[null,null,null,null,null,null,null,null,0,null,"","","",""]
[null,null,null,null,null,null,null,null,0,null,"","","",""]
[null,null,null,null,null,null,null,null,0,null,"","","",""]
[null,null,null,null,null,null,null,null,0,null,"","","",""]
[null,null,null,null,null,null,null,null,0,null,"","","",""]
[null,null,null,null,null,null,null,null,0,null,"","","",""]
[null,null,null,null,null,null,null,null,0,null,"","","",""]
[null,null,null,null,null,null,null,null,0,null,"","","",""]
[null,null,null,null,null,null,null,null,0,null,"","","",""]
[null,null,null,null,null,null,null,null,0,null,"","","",""]
[null,null,null,null,null,null,null,null,0,null,"","","",""]
[null,null,null,null,null,null,null,null,0,null,"","","",""]
[null,null,null,null,null,null,null,null,0,null,"","","",""]
[null,null,null,null,null,null,null,null,0,null,"","","",""]
[null,null,null,null,null,null,null,null,0,null,"","","",""]
[null,null,null,null,null,null,null,null,0,null,"","","",""]
[null,null,null,null,null,null,null,null,0,null,"","","",""]
[null,null,null,null,null,null,null,null,0,null,"","","",""]
[null,null,null,null,null,null,null,null,0,null,"","","",""]
[null,null,null,null,null,null,null,null,0,null,"","","",""]
[null,null,null,null,null,null,null,null,0,null,"","","",""]
[null,null,null,null,null,null,null,null,0,null,"","","",""]
[null,null,null,null,null,null,null,null,0,null,"","","",""]
[null,null,null,null,null,null,null,null,0,null,"","","",""]
[null,null,null,null,null,null,null,null,0,null,"","","",""]
[null,null,null,null,null,null,null,null,0,null,{"$f":"IFERROR(IF(J3687<>\"\",F3687*J3687,\"\"),\"\")","v":""},{"$f":"IFERROR(IF(J3687<>\"\",G3687*J3687,\"\"),\"\")","v":""},{"$f":"IFERROR(IF(J3687<>\"\",H3687*J3687,\"\"),\"\")","v":""},{"$f":"IFERROR(L3687+M3687,\"\")","v":""}]
[null,null,null,null,null,null,null,null,0,null,"","","",""]
[null,null,null,null,null,null,null,null,0,null,"","","",""]
[null,null,null,null,null,null,null,null,0,null,"","","",""]
[null,null,null,null,null,null,null,null,0,null,"","","",""]
[null,null,null,null,null,null,null,null,0,null,"","","",""]
[null,null,null,null,null,null,null,null,0,null,"","","",""]
[null,null,null,null,null,null,null,null,0,null,"","","",""]
[null,null,null,null,null,null,null,null,0,null,"","","",""]
[null,null,null,null,null,null,null,null,0,null,"","","",""]
[null,null,null,null,null,null,null,null,0,null,"","","",""]
[null,null,null,null,null,null,null,null,0,null,"","","",""]
[null,null,null,null,null,null,null,null,0,null,"","","",""]
[null,null,null,null,null,null,null,null,0,null,"","","",""]
[null,null,null,null,null,null,null,null,0,null,"","","",""]
[null,null,null,null,null,null,null,null,0,null,"","","",""]
[null,null,null,null,null,null,null,null,0,null,"","","",""]
[null,null,null,null,null,null,null,null,0,null,"","","",""]
[null,null,null,null,null,null,null,null,0,null,"","","",""]
[null,null,null,null,null,null,null,null,0,null,"","","",""]
[null,null,null,null,null,null,null,null,0,null,"","","",""]
[null,null,null,null,null,null,null,null,0,null,"","","",""]
[null,null,null,null,null,null,null,null,0,null,"","","",""]
[null,null,null,null,null,null,null,null,0,null,"","","",""]
[null,null,null,null,null,null,null,null,0,null,"","","",""]
[null,null,null,null,null,null,null,null,0,null,"","","",""]
[null,null,null,null,null,null,null,null,0,null,"","","",""]
[null,null,null,null,null,null,null,null,0,null,"","","",""]
[null,null,null,null,null,null,null,null,0,null,"","","",""]
[null,null,null,null,null,null,null,null,0,null,"","","",""]
[null,null,null,null,null,null,null,null,0,null,"","","",""]
[null,null,null,null,null,null,null,null,0,null,"","","",""]
[null,null,null,null,null,null,null,null,0,null,"","","",""]
[null,null,null,null,null,null,null,null,0,null,"","","",""]
[null,null,null,null,null,null,null,null,0,null,"","","",""]
[null,null,null,null,null,null,null,null,{"$f":"IFERROR(G3722+H3722,\"\")","v":0},null,"","","",""]
[null,null,null,null,null,null,null,null,0,null,"","","",""]
[null,null,null,null,null,null,null,null,0,null,"","","",""]
[null,null,null,null,null,null,null,null,0,null,"","","",""]
[null,null,null,null,null,null,null,null,0,null,"","","",""]
[null,null,null,null,null,null,null,null,0,null,"","","",""]
[null,null,null,null,null,null,null,null,0,null,"","","",""]
[null,null,null,null,null,null,null,null,0,null,"","","",""]
[null,null,null,null,null,null,null,null,0,null,"","","",""]
[null,null,null,null,null,null,null,null,0,null,"","","",""]
[null,null,null,null,null,null,null,null,0,null,"","","",""]
[null,null,null,null,null,null,null,null,0,null,"","","",""]
[null,null,null,null,null,null,null,null,0,null,"","","",""]
[null,null,null,null,null,null,null,null,0,null,"","","",""]
[null,null,null,null,null,null,null,null,0,null,"","","",""]
[null,null,null,null,null,null,null,null,0,null,"","","",""]
[null,null,null,null,null,null,null,null,0,null,"","","",""]
[null,null,null,null,null,null,null,null,0,null,"","","",""]
[null,null,null,null,null,null,null,null,0,null,"","","",""]
[null,null,null,null,null,null,null,null,0,null,"","","",""]
[null,null,null,null,null,null,null,null,0,null,"","","",""]
[null,null,null,null,null,null,null,null,0,null,"","","",""]
[null,null,null,null,null,null,null,null,0,null,"","","",""]
[null,null,null,null,null,null,null,null,0,null,"","","",""]
[null,null,null,null,null,null,null,null,0,null,"","","",""]
[null,null,null,null,null,null,null,null,0,null,"","","",""]
[null,null,null,null,null,null,null,null,0,null,"","","",""]
[null,null,null,null,null,null,null,null,0,null,"","","",""]
[null,null,null,null,null,null,null,null,0,null,"","","",""]
[null,null,null,null,null,null,null,null,0,null,{"$f":"IFERROR(IF(J3751<>\"\",F3751*J3751,\"\"),\"\")","v":""},{"$f":"IFERROR(IF(J3751<>\"\",G3751*J3751,\"\"),\"\")","v":""},{"$f":"IFERROR(IF(J3751<>\"\",H3751*J3751,\"\"),\"\")","v":""},{"$f":"IFERROR(L3751+M3751,\"\")","v":""}]
[null,null,null,null,null,null,null,null,0,null,"","","",""]
[null,null,null,null,null,null,null,null,0,null,"","","",""]
[null,null,null,null,null,null,null,null,0,null,"","","",""]
[null,null,null,null,null,null,null,null,0,null,"","","",""]
[null,null,null,null,null,null,null,null,0,null,"","","",""]
[null,null,null,null,null,null,null,null,0,null,"","","",""]
[null,null,null,null,null,null,null,null,0,null,"","","",""]
[null,null,null,null,null,null,null,null,0,null,"","","",""]
[null,null,null,null,null,null,null,null,0,null,"","","",""]
[null,null,null,null,null,null,null,null,0,null,"","","",""]
[null,null,null,null,null,null,null,null,0,null,"","","",""]
[null,null,null,null,null,null,null,null,0,null,"","","",""]
[null,null,null,null,null,null,null,null,0,null,"","","",""]
[null,null,null,null,null,null,null,null,0,null,"","","",""]
[null,null,null,null,null,null,null,null,0,null,"","","",""]
[null,null,null,null,null,null,null,null,0,null,"","","",""]
[null,null,null,null,null,null,null,null,0,null,"","","",""]
[null,null,null,null,null,null,null,null,0,null,"","","",""]
[null,null,null,null,null,null,null,null,0,null,"","","",""]
[null,null,null,null,null,null,null,null,0,null,"","","",""]
[null,null,null,null,null,null,null,null,0,null,"","","",""]
[null,null,null,null,null,null,null,null,0,null,"","","",""]
[null,null,null,null,null,null,null,null,0,null,"","","",""]
[null,null,null,null,null,null,null,null,0,null,"","","",""]
[null,null,null,null,null,null,null,null,0,null,"","","",""]
[null,null,null,null,null,null,null,null,0,null,"","","",""]
[null,null,null,null,null,null,null,null,0,null,"","","",""]
[null,null,null,null,null,null,null,null,0,null,"","","",""]
[null,null,null,null,null,null,null,null,0,null,"","","",""]
[null,null,null,null,null,null,null,null,0,null,"","","",""]
[null,null,null,null,null,null,null,null,0,null,"","","",""]
[null,null,null,null,null,null,null,null,0,null,"","","",""]
[null,null,null,null,null,null,null,null,0,null,"","","",""]
[null,null,null,null,null,null,null,null,0,null,"","","",""]
[null,null,null,null,null,null,null,null,{"$f":"IFERROR(G3786+H3786,\"\")","v":0},null,"","","",""]
[null,null,null,null,null,null,null,null,0,null,"","","",""]
[null,null,null,null,null,null,null,null,0,null,"","","",""]
[null,null,null,null,null,null,null,null,0,null,"","","",""]
[null,null,null,null,null,null,null,null,0,null,"","","",""]
[null,null,null,null,null,null,null,null,0,null,"","","",""]
[null,null,null,null,null,null,null,null,0,null,"","","",""]
[null,null,null,null,null,null,null,null,0,null,"","","",""]
[null,null,null,null,null,null,null,null,0,null,"","","",""]
[null,null,null,null,null,null,null,null,0,null,"","","",""]
[null,null,null,null,null,null,null,null,0,null,"","","",""]
[null,null,null,null,null,null,null,null,0,null,"","","",""]
[null,null,null,null,null,null,null,null,0,null,"","","",""]
[null,null,null,null,null,null,null,null,0,null,"","","",""]
[null,null,null,null,null,null,null,null,0,null,"","","",""]
[null,null,null,null,null,null,null,null,0,null,"","","",""]
[null,null,null,null,null,null,null,null,0,null,"","","",""]
[null,null,null,null,null,null,null,null,0,null,"","","",""]
[null,null,null,null,null,null,null,null,0,null,"","","",""]
[null,null,null,null,null,null,null,null,0,null,"","","",""]
[null,null,null,null,null,null,null,null,0,null,"","","",""]
[null,null,null,null,null,null,null,null,0,null,"","","",""]
[null,null,null,null,null,null,null,null,0,null,"","","",""]
[null,null,null,null,null,null,null,null,0,null,"","","",""]
[null,null,null,null,null,null,null,null,0,null,"","","",""]
[null,null,null,null,null,null,null,null,0,null,"","","",""]
[null,null,null,null,null,null,null,null,0,null,"","","",""]
[null,null,null,null,null,null,null,null,0,null,"","","",""]
[null,null,null,null,null,null,null,null,0,null,"","","",""]
[null,null,null,null,null,null,null,null,0,null,{"$f":"IFERROR(IF(J3815<>\"\",F3815*J3815,\"\"),\"\")","v":""},{"$f":"IFERROR(IF(J3815<>\"\",G3815*J3815,\"\"),\"\")","v":""},{"$f":"IFERROR(IF(J3815<>\"\",H3815*J3815,\"\"),\"\")","v":""},{"$f":"IFERROR(L3815+M3815,\"\")","v":""}]
[null,null,null,null,null,null,null,null,0,null,"","","",""]
[null,null,null,null,null,null,null,null,0,null,"","","",""]
[null,null,null,null,null,null,null,null,0,null,"","","",""]
[null,null,null,null,null,null,null,null,0,null,"","","",""]
[null,null,null,null,null,null,null,null,0,null,"","","",""]
[null,null,null,null,null,null,null,null,0,null,"","","",""]
[null,null,null,null,null,null,null,null,0,null,"","","",""]
[null,null,null,null,null,null,null,null,0,null,"","","",""]
[null,null,null,null,null,null,null,null,0,null,"","","",""]
[null,null,null,null,null,null,null,null,0,null,"","","",""]
[null,null,null,null,null,null,null,null,0,null,"","","",""]
[null,null,null,null,null,null,null,null,0,null,"","","",""]
[null,null,null,null,null,null,null,null,0,null,"","","",""]
[null,null,null,null,null,null,null,null,0,null,"","","",""]
[null,null,null,null,null,null,null,null,0,null,"","","",""]
[null,null,null,null,null,null,null,null,0,null,"","","",""]
[null,null,null,null,null,null,null,null,0,null,"","","",""]
[null,null,null,null,null,null,null,null,0,null,"","","",""]
[null,null,null,null,null,null,null,null,0,null,"","","",""]
[null,null,null,null,null,null,null,null,0,null,"","","",""]
[null,null,null,null,null,null,null,null,0,null,"","","",""]
[null,null,null,null,null,null,null,null,0,null,"","","",""]
[null,null,null,null,null,null,null,null,0,null,"","","",""]
[null,null,null,null,null,null,null,null,0,null,"","","",""]
[null,null,null,null,null,null,null,null,0,null,"","","",""]
[null,null,null,null,null,null,null,null,0,null,"","","",""]
[null,null,null,null,null,null,null,null,0,null,"","","",""]
[null,null,null,null,null,null,null,null,0,null,"","","",""]
[null,null,null,null,null,null,null,null,0,null,"","","",""]
[null,null,null,null,null,null,null,null,0,null,"","","",""]
[null,null,null,null,null,null,null,null,0,null,"","","",""]
[null,null,null,null,null,null,null,null,0,null,"","","",""]
[null,null,null,null,null,null,null,null,0,null,"","","",""]
[null,null,null,null,null,null,null,null,0,null,"","","",""]
[null,null,null,null,null,null,null,null,{"$f":"IFERROR(G3850+H3850,\"\")","v":0},null,"","","",""]
[null,null,null,null,null,null,null,null,0,null,"","","",""]
[null,null,null,null,null,null,null,null,0,null,"","","",""]
[null,null,null,null,null,null,null,null,0,null,"","","",""]
[null,null,null,null,null,null,null,null,0,null,"","","",""]
[null,null,null,null,null,null,null,null,0,null,"","","",""]
[null,null,null,null,null,null,null,null,0,null,"","","",""]
[null,null,null,null,null,null,null,null,0,null,"","","",""]
[null,null,null,null,null,null,null,null,0,null,"","","",""]
[null,null,null,null,null,null,null,null,0,null,"","","",""]
[null,null,null,null,null,null,null,null,0,null,"","","",""]
[null,null,null,null,null,null,null,null,0,null,"","","",""]
[null,null,null,null,null,null,null,null,0,null,"","","",""]
[null,null,null,null,null,null,null,null,0,null,"","","",""]
[null,null,null,null,null,null,null,null,0,null,"","","",""]
[null,null,null,null,null,null,null,null,0,null,"","","",""]
[null,null,null,null,null,null,null,null,0,null,"","","",""]
[null,null,null,null,null,null,null,null,0,null,"","","",""]
[null,null,null,null,null,null,null,null,0,null,"","","",""]
[null,null,null,null,null,null,null,null,0,null,"","","",""]
[null,null,null,null,null,null,null,null,0,null,"","","",""]
[null,null,null,null,null,null,null,null,0,null,"","","",""]
[null,null,null,null,null,null,null,null,0,null,"","","",""]
[null,null,null,null,null,null,null,null,0,null,"","","",""]
[null,null,null,null,null,null,null,null,0,null,"","","",""]
[null,null,null,null,null,null,null,null,0,null,"","","",""]
[null,null,null,null,null,null,null,null,0,null,"","","",""]
[null,null,null,null,null,null,null,null,0,null,"","","",""]
[null,null,null,null,null,null,null,null,0,null,"","","",""]
[null,null,null,null,null,null,null,null,0,null,{"$f":"IFERROR(IF(J3879<>\"\",F3879*J3879,\"\"),\"\")","v":""},{"$f":"IFERROR(IF(J3879<>\"\",G3879*J3879,\"\"),\"\")","v":""},{"$f":"IFERROR(IF(J3879<>\"\",H3879*J3879,\"\"),\"\")","v":""},{"$f":"IFERROR(L3879+M3879,\"\")","v":""}]
[null,null,null,null,null,null,null,null,0,null,"","","",""]
[null,null,null,null,null,null,null,null,0,null,"","","",""]
[null,null,null,null,null,null,null,null,0,null,"","","",""]
[null,null,null,null,null,null,null,null,0,null,"","","",""]
[null,null,null,null,null,null,null,null,0,null,"","","",""]
[null,null,null,null,null,null,null,null,0,null,"","","",""]
[null,null,null,null,null,null,null,null,0,null,"","","",""]
[null,null,null,null,null,null,null,null,0,null,"","","",""]
[null,null,null,null,null,null,null,null,0,null,"","","",""]
[null,null,null,null,null,null,null,null,0,null,"","","",""]
[null,null,null,null,null,null,null,null,0,null,"","","",""]
[null,null,null,null,null,null,null,null,0,null,"","","",""]
[null,null,null,null,null,null,null,null,0,null,"","","",""]
[null,null,null,null,null,null,null,null,0,null,"","","",""]
[null,null,null,null,null,null,null,null,0,null,"","","",""]
[null,null,null,null,null,null,null,null,0,null,"","","",""]
[null,null,null,null,null,null,null,null,0,null,"","","",""]
[null,null,null,null,null,null,null,null,0,null,"","","",""]
[null,null,null,null,null,null,null,null,0,null,"","","",""]
[null,null,null,null,null,null,null,null,0,null,"","","",""]
[null,null,null,null,null,null,null,null,0,null,"","","",""]
[null,null,null,null,null,null,null,null,0,null,"","","",""]
[null,null,null,null,null,null,null,null,0,null,"","","",""]
[null,null,null,null,null,null,null,null,0,null,"","","",""]
[null,null,null,null,null,null,null,null,0,null,"","","",""]
[null,null,null,null,null,null,null,null,0,null,"","","",""]
[null,null,null,null,null,null,null,null,0,null,"","","",""]
[null,null,null,null,null,null,null,null,0,null,"","","",""]
[null,null,null,null,null,null,null,null,0,null,"","","",""]
[null,null,null,null,null,null,null,null,0,null,"","","",""]
[null,null,null,null,null,null,null,null,0,null,"","","",""]
[null,null,null,null,null,null,null,null,0,null,"","","",""]
[null,null,null,null,null,null,null,null,0,null,"","","",""]
[null,null,null,null,null,null,null,null,0,null,"","","",""]
[null,null,null,null,null,null,null,null,{"$f":"IFERROR(G3914+H3914,\"\")","v":0},null,"","","",""]
[null,null,null,null,null,null,null,null,0,null,"","","",""]
[null,null,null,null,null,null,null,null,0,null,"","","",""]
[null,null,null,null,null,null,null,null,0,null,"","","",""]
[null,null,null,null,null,null,null,null,0,null,"","","",""]
[null,null,null,null,null,null,null,null,0,null,"","","",""]
[null,null,null,null,null,null,null,null,0,null,"","","",""]
[null,null,null,null,null,null,null,null,0,null,"","","",""]
[null,null,null,null,null,null,null,null,0,null,"","","",""]
[null,null,null,null,null,null,null,null,0,null,"","","",""]
[null,null,null,null,null,null,null,null,0,null,"","","",""]
[null,null,null,null,null,null,null,null,0,null,"","","",""]
[null,null,null,null,null,null,null,null,0,null,"","","",""]
[null,null,null,null,null,null,null,null,0,null,"","","",""]
[null,null,null,null,null,null,null,null,0,null,"","","",""]
[null,null,null,null,null,null,null,null,0,null,"","","",""]
[null,null,null,null,null,null,null,null,0,null,"","","",""]
[null,null,null,null,null,null,null,null,0,null,"","","",""]
[null,null,null,null,null,null,null,null,0,null,"","","",""]
[null,null,null,null,null,null,null,null,0,null,"","","",""]
[null,null,null,null,null,null,null,null,0,null,"","","",""]
[null,null,null,null,null,null,null,null,0,null,"","","",""]
[null,null,null,null,null,null,null,null,0,null,"","","",""]
[null,null,null,null,null,null,null,null,0,null,"","","",""]
[null,null,null,null,null,null,null,null,0,null,"","","",""]
[null,null,null,null,null,null,null,null,0,null,"","","",""]
[null,null,null,null,null,null,null,null,0,null,"","","",""]
[null,null,null,null,null,null,null,null,0,null,"","","",""]
[null,null,null,null,null,null,null,null,0,null,"","","",""]
[null,null,null,null,null,null,null,null,0,null,{"$f":"IFERROR(IF(J3943<>\"\",F3943*J3943,\"\"),\"\")","v":""},{"$f":"IFERROR(IF(J3943<>\"\",G3943*J3943,\"\"),\"\")","v":""},{"$f":"IFERROR(IF(J3943<>\"\",H3943*J3943,\"\"),\"\")","v":""},{"$f":"IFERROR(L3943+M3943,\"\")","v":""}]
[null,null,null,null,null,null,null,null,0,null,"","","",""]
[null,null,null,null,null,null,null,null,0,null,"","","",""]
[null,null,null,null,null,null,null,null,0,null,"","","",""]
[null,null,null,null,null,null,null,null,0,null,"","","",""]
[null,null,null,null,null,null,null,null,0,null,"","","",""]
[null,null,null,null,null,null,null,null,0,null,"","","",""]
[null,null,null,null,null,null,null,null,0,null,"","","",""]
[null,null,null,null,null,null,null,null,0,null,"","","",""]
[null,null,null,null,null,null,null,null,0,null,"","","",""]
[null,null,null,null,null,null,null,null,0,null,"","","",""]
[null,null,null,null,null,null,null,null,0,null,"","","",""]
[null,null,null,null,null,null,null,null,0,null,"","","",""]
[null,null,null,null,null,null,null,null,0,null,"","","",""]
[null,null,null,null,null,null,null,null,0,null,"","","",""]
[null,null,null,null,null,null,null,null,0,null,"","","",""]
[null,null,null,null,null,null,null,null,0,null,"","","",""]
[null,null,null,null,null,null,null,null,0,null,"","","",""]
[null,null,null,null,null,null,null,null,0,null,"","","",""]
[null,null,null,null,null,null,null,null,0,null,"","","",""]
[null,null,null,null,null,null,null,null,0,null,"","","",""]
[null,null,null,null,null,null,null,null,0,null,"","","",""]
[null,null,null,null,null,null,null,null,0,null,"","","",""]
[null,null,null,null,null,null,null,null,0,null,"","","",""]
[null,null,null,null,null,null,null,null,0,null,"","","",""]
[null,null,null,null,null,null,null,null,0,null,"","","",""]
[null,null,null,null,null,null,null,null,0,null,"","","",""]
[null,null,null,null,null,null,null,null,0,null,"","","",""]
[null,null,null,null,null,null,null,null,0,null,"","","",""]
[null,null,null,null,null,null,null,null,0,null,"","","",""]
[null,null,null,null,null,null,null,null,0,null,"","","",""]
[null,null,null,null,null,null,null,null,0,null,"","","",""]
[null,null,null,null,null,null,null,null,0,null,"","","",""]
[null,null,null,null,null,null,null,null,0,null,"","","",""]
[null,null,null,null,null,null,null,null,0,null,"","","",""]
[null,null,null,null,null,null,null,null,{"$f":"IFERROR(G3978+H3978,\"\")","v":0},null,"","","",""]
[null,null,null,null,null,null,null,null,0,null,"","","",""]
[null,null,null,null,null,null,null,null,0,null,"","","",""]
[null,null,null,null,null,null,null,null,0,null,"","","",""]
[null,null,null,null,null,null,null,null,0,null,"","","",""]
[null,null,null,null,null,null,null,null,0,null,"","","",""]
[null,null,null,null,null,null,null,null,0,null,"","","",""]
[null,null,null,null,null,null,null,null,0,null,"","","",""]
[null,null,null,null,null,null,null,null,0,null,"","","",""]
[null,null,null,null,null,null,null,null,0,null,"","","",""]
[null,null,null,null,null,null,null,null,0,null,"","","",""]
[null,null,null,null,null,null,null,null,0,null,"","","",""]
[null,null,null,null,null,null,null,null,0,null,"","","",""]
[null,null,null,null,null,null,null,null,0,null,"","","",""]
[null,null,null,null,null,null,null,null,0,null,"","","",""]
[null,null,null,null,null,null,null,null,0,null,"","","",""]
[null,null,null,null,null,null,null,null,0,null,"","","",""]
[null,null,null,null,null,null,null,null,0,null,"","","",""]
[null,null,null,null,null,null,null,null,0,null,"","","",""]
[null,null,null,null,null,null,null,null,0,null,"","","",""]
[null,null,null,null,null,null,null,null,0,null,"","","",""]
[null,null,null,null,null,null,null,null,0,null,"","","",""]
[null,null,null,null,null,null,null,null,0,null,"","","",""]

{"sheet":"LOA","index":7,"n_rows":14,"n_cols":10,"rows_kept":14,"cut":false,"hidden":false,"merged":[[7,2,7,4],[0,7,0,8],[1,3,3,4],[4,2,4,4],[5,2,5,4],[6,2,6,4],[12,5,13,5],[12,6,12,9],[8,2,8,4],[9,2,9,4],[10,1,10,2],[10,3,10,4],[12,1,13,1],[12,2,13,2],[12,3,13,3],[12,4,13,4]]}
[null,null,null,null,null,null,null,"STD-AL-910-MD20993",null,"Rev 07"]
[null,null,null,"Lijst onderaannemer(s)"]
[]
[]
[null,"TE nummer",{"$f":"'0.basisgegevens'!B2","v":0}]
[null,"Project naam",{"$f":"'0.basisgegevens'!B3","v":0}]
[null,"Perceel nummer",{"$f":"'0.basisgegevens'!B4","v":0}]
[null,"Werf meldingsnummer"]
[null,"Hoofdaannemer"]
[null,"Ondernemings nummer"]
[null,"Zijn er onderaannemers aangesteld?",null,"Ja/Nee?"]
[]
[null,"Onderaannemer(s)","Ondernemings nummer","In opdracht van","Graad van onder aanneming","Aard v/d werken","Contact gegevens"]
[null,null,null,null,null,null,"Contact persoon","E-mail","Telefoon1","Telefoon2"]

{"sheet":"Toelichting Lijst OA","index":8,"n_rows":3,"n_cols":2,"rows_kept":3,"cut":false,"hidden":false,"merged":[[1,1,1,14],[2,1,2,14]]}
[]
[null,"Volgens de bepalingen in artikel 12/1 en 12/2 van de wetgeving op overheidsopdrachten is de opdrachtnemer tijdens de volledige looptijd van de opdrachten gehouden de aanbesteder onverwijld in kennis te stellen van alle gegevens van onderaanneming, alsmede van de vereiste gegevens betreffende eventuele nieuwe onderaannemers die hij nadien bij de uitvoering van deze werken of verlening van deze diensten zal betrekken"]
[null,"Onderstaand stroom diagramma geeft de verwachting van UZ Leuven aan, al naargelang of u met onderaannemer(s), VS of facturen werkt."]

{"sheet":"Sjabloon revisies","index":9,"n_rows":15,"n_cols":4,"rows_kept":15,"cut":false,"hidden":false,"merged":[[11,1,12,1]]}
[]
[null,"Revisie","Datum","Omschrijving"]
[null,2,"2019-10-07","\n• mogelijkheid aangeven BTW verlegd\n"]
[null,3,"2019-11-22","• stroomdiagramme informatie plicht onderaannemer\n• mogelijkheid aangeven BTW verlegd\n• % overzicht\n• rapportering OA"]
[null,4,"2020-06-09","• opdeling mogelijk om te werken met derden\n• oplijning invul velden\n• ontdubbeling van sommige velden"]
[null,5,"2020-09-29","• Bestelbon nr toegevoegd\n• Default weergave aangepast. Deel derden en gemeenschappelijk zijn default verborgen\n• Correctie formule BTW deel gemeenschappelijk\n• Ondertekenings velden voorzien voor PCO & LA\n• Onderteken veld 'derden' enkel zichtbaar indien derden betrokken zijn\n• Tabblad 'hoe gebruiken' toegevoegd met toelichting rond gebruik werkbladen '3.VS1-A' en '4.VS1-B'"]
[null,6,"2020-12-14","• overzetten basis gegevens \"functie omschrijvingen \" naar tabblad 1. Overzicht Vorderingsstaat gecorrigeerd."]
[null,7,"2021-06-07","• beperking op VS nr veld (enkel nummeriek) om te voorkomen dat men tekst ingeeft in VS nr veld en dit de werking van de formules beïnvloed. Bijkomend toevoeging veld omschrijving, index om omschrijving mogelijk te maken\n• toevoeging alle contacten in werkblad 1.overzicht VS\n• in werkblad 2.vorderingsstaat \"Bedrag goedgekeurde wijzigingen\" aangepast zodat deelB exclusief herziening wordt getoond.\n• Datum niet langer automatisch als datum van vandaag ingesteld. Door gebruiker zelf in te vullen. Voorkomt verwarring indien VS als excel bestand wordt ingediend en nadien afgedrukt."]
[null,8,"2021-08-24","aanpassing configuratie om VS Nr 0 toe te laten"]
[null,9,"2021-10-20","• Formule correctie"]
[null,10,"2022-08-17","• Datum veld formule in Ws 3.VS1-A en 4.VS1-B gecorrigeerd\n• Werkblad LOA toegevoegd en 'toelichting Lijst OA' aangepast"]
[null,11,"2023-08-17","• formatting 3.VS1-A, 4.VS1-B geoptimaliseerd\n• Bestelbon referenties verplaatst naar werkblad met overzicht details zodat voor elke bestelbon bedrag kan opgegeven worden\n• 3.VS en 4.VS hernoemt (nr 1 uit naamgeving gehaald)\n• titels in 3.VS-A en 3.VS-B gekoppeld aan nr van VS zodat dit altijd mee geupdate is met huidig VS nr\n• functionaliteit voorzien om PDF te genereren met de juiste werkbladen. Deze stelt ook de afdrukbereiken juist in aan de hand van de kolom rechts i/d relevante werkbladen(lijnt op met laatste rij die omschrijving bevat in meetstaat werkbladen.\n• Veld BTW deel gemeenschappelijk vormgeving/vermelding aangepast\n• optimalisatie werkblad '2.Vorderingsstaat' voor afdrukbereik voor verschillende weergaves/\n• In te vullen informatie van werkblad '2.Vorderingsstaat' verplaatst naar '1.Overzicht vorderingsstaat' als vereenvoudiging.\n• Maandelijkse index ingave en berekening adhv formules voor DeelA, DeelB blijft manueel in te geven daar herziening niet steeds van toepassing is."]
[null,null,"2024-01-15","• Draft verwijderd in document referentie op voorblad"]
[null,12,"2024-08-08","• Formule in werkblad 1.Overzicht Vorderingsstaat toegevoegd om TE nr van basis gegeven over te zetten"]
[null,13,"2025-04-29","• extra rijen zodat tot 30 periodes kunnen worden ingevuld\n• aangepast std doc nr SJA_TD_AL_0033_MD21735\n• Index in tabblad '1.Overzicht vorderingsstaat' van format aangepast datum > standaard\n• 4.VS-B cumul formule toegevoegd\n• 3.VS-A en 4.VS-B aantal rijen aangepast naar 4000 + Bijhorende totaal formules (+ deze in € ingesteld)"]